Skip to content
  • Home
  • Aktuell
  • Tags
  • 0 Ungelesen 0
  • Kategorien
  • Unreplied
  • Beliebt
  • GitHub
  • Docu
  • Hilfe
Skins
  • Light
  • Brite
  • Cerulean
  • Cosmo
  • Flatly
  • Journal
  • Litera
  • Lumen
  • Lux
  • Materia
  • Minty
  • Morph
  • Pulse
  • Sandstone
  • Simplex
  • Sketchy
  • Spacelab
  • United
  • Yeti
  • Zephyr
  • Dark
  • Cyborg
  • Darkly
  • Quartz
  • Slate
  • Solar
  • Superhero
  • Vapor

  • Standard: (Kein Skin)
  • Kein Skin
Einklappen
ioBroker Logo

Community Forum

donate donate
  1. ioBroker Community Home
  2. Deutsch
  3. Tester
  4. Alpha Test js-controller 4.0

NEWS

  • UPDATE 31.10.: Amazon Alexa - ioBroker Skill läuft aus ?
    apollon77A
    apollon77
    48
    3
    8.7k

  • Monatsrückblick – September 2025
    BluefoxB
    Bluefox
    13
    1
    2.2k

  • Neues Video "KI im Smart Home" - ioBroker plus n8n
    BluefoxB
    Bluefox
    16
    1
    3.1k

Alpha Test js-controller 4.0

Geplant Angeheftet Gesperrt Verschoben Tester
196 Beiträge 20 Kommentatoren 27.5k Aufrufe 22 Watching
  • Älteste zuerst
  • Neuste zuerst
  • Meiste Stimmen
Antworten
  • In einem neuen Thema antworten
Anmelden zum Antworten
Dieses Thema wurde gelöscht. Nur Nutzer mit entsprechenden Rechten können es sehen.
  • FeuersturmF Online
    FeuersturmF Online
    Feuersturm
    schrieb am zuletzt editiert von
    #186

    @apollon77

    Ich hab gerade den Slave (iobrokerNew) ebenfalls auf 4.0.3 aktualisiert.
    Danach hab ich mal den Master per iobroker stop ausgeschaltet. Der Slave meldet berechtigterweise

    host.ioBrokerNew Objects database error: connect ECONNREFUSED 192.168.178.77:9001 
    

    danach hab ich den Master wieder gestartet. Beim hochfahren war im Log folgende Warnungen / Fehler vom Master / Slave im Log

    05 Feb 2022 12:09:23.686
    iobrokerTestsystemSlave host.ioBrokerNew Could not execute primary host determination: Error Unknown Script b0bd9e6fd92479ccf43654a7ba7443c915d0a742
    05 Feb 2022 12:09:23.683
    iobrokerTestsystemSlave host.ioBrokerNew Could not execute primary host determination: Error Unknown Script b0bd9e6fd92479ccf43654a7ba7443c915d0a742
    05 Feb 2022 12:09:23.678
    iobrokerTestsystem host.ioBrokerTestsystem-Server Objects 192.168.178.78:48414 Error from InMemDB: Error: Unknown Script b0bd9e6fd92479ccf43654a7ba7443c915d0a742
    05 Feb 2022 12:09:23.675
    iobrokerTestsystemSlave host.ioBrokerNew States database error: connect ECONNREFUSED 192.168.178.77:9000
    05 Feb 2022 12:09:23.675
    iobrokerTestsystem host.ioBrokerTestsystem-Server Objects 192.168.178.78:48414 Error from InMemDB: Error: Unknown Script b0bd9e6fd92479ccf43654a7ba7443c915d0a742 
    

    Vollständiges Log:

    05 Feb 2022 12:09:30.646
    iobrokerTestsystem admin.0 (26234) requesting all objects
    05 Feb 2022 12:09:30.644
    iobrokerTestsystem admin.0 (26234) requesting all states
    05 Feb 2022 12:09:30.554
    iobrokerTestsystem admin.0 (26234) starting. Version 5.2.3 in /opt/iobroker/node_modules/iobroker.admin, node: v14.19.0, js-controller: 4.0.3
    05 Feb 2022 12:09:30.327
    iobrokerTestsystem host.ioBrokerTestsystem instance system.adapter.javascript.0 started with pid 26245
    05 Feb 2022 12:09:28.683
    iobrokerTestsystemSlave host.ioBrokerNew Objects database successfully reconnected
    05 Feb 2022 12:09:26.363
    iobrokerTestsystem host.ioBrokerTestsystem instance system.adapter.admin.0 started with pid 26234
    05 Feb 2022 12:09:26.110
    iobrokerTestsystem host.ioBrokerTestsystem starting 29 instances
    05 Feb 2022 12:09:25.968
    iobrokerTestsystem host.ioBrokerTestsystem 58 instances found
    05 Feb 2022 12:09:24.957
    iobrokerTestsystem host.ioBrokerTestsystem added notifications configuration of host
    05 Feb 2022 12:09:24.923
    iobrokerTestsystem host.ioBrokerTestsystem connected to Objects and States
    05 Feb 2022 12:09:23.686
    iobrokerTestsystemSlave host.ioBrokerNew Could not execute primary host determination: Error Unknown Script b0bd9e6fd92479ccf43654a7ba7443c915d0a742
    05 Feb 2022 12:09:23.683
    iobrokerTestsystemSlave host.ioBrokerNew Could not execute primary host determination: Error Unknown Script b0bd9e6fd92479ccf43654a7ba7443c915d0a742
    05 Feb 2022 12:09:23.678
    iobrokerTestsystem host.ioBrokerTestsystem-Server Objects 192.168.178.78:48414 Error from InMemDB: Error: Unknown Script b0bd9e6fd92479ccf43654a7ba7443c915d0a742
    05 Feb 2022 12:09:23.675
    iobrokerTestsystemSlave host.ioBrokerNew States database error: connect ECONNREFUSED 192.168.178.77:9000
    05 Feb 2022 12:09:23.675
    iobrokerTestsystem host.ioBrokerTestsystem-Server Objects 192.168.178.78:48414 Error from InMemDB: Error: Unknown Script b0bd9e6fd92479ccf43654a7ba7443c915d0a742
    05 Feb 2022 12:09:23.585
    iobrokerTestsystemSlave host.ioBrokerNew Objects database successfully reconnected
    05 Feb 2022 12:09:22.215
    iobrokerTestsystem host.ioBrokerTestsystem ip addresses: 192.168.178.77 fe80::f854:cfff:fe5f:6c25
    05 Feb 2022 12:09:22.212
    iobrokerTestsystem host.ioBrokerTestsystem hostname: ioBrokerTestsystem, node: v14.19.0
    05 Feb 2022 12:09:22.210
    iobrokerTestsystem host.ioBrokerTestsystem Copyright (c) 2014-2022 bluefox, 2014 hobbyquaker
    05 Feb 2022 12:09:22.204
    iobrokerTestsystem host.ioBrokerTestsystem iobroker.js-controller version 4.0.3 js-controller starting
    05 Feb 2022 12:09:18.668
    iobrokerTestsystemSlave host.ioBrokerNew States database error: connect ECONNREFUSED 192.168.178.77:9000
    05 Feb 2022 12:09:18.576
    iobrokerTestsystemSlave host.ioBrokerNew Objects database error: connect ECONNREFUSED 192.168.178.77:9001
    05 Feb 2022 12:09:13.660
    iobrokerTestsystemSlave host.ioBrokerNew States database error: connect ECONNREFUSED 192.168.178.77:9000
    05 Feb 2022 12:09:13.569
    iobrokerTestsystemSlave host.ioBrokerNew Objects database error: connect ECONNREFUSED 192.168.178.77:9001 
    
    apollon77A 1 Antwort Letzte Antwort
    0
    • MalleRalleM Offline
      MalleRalleM Offline
      MalleRalle
      schrieb am zuletzt editiert von
      #187

      Hier mit der 4.0.3 auch alles ordentlich durchgelaufen.

      1 Antwort Letzte Antwort
      1
      • FeuersturmF Feuersturm

        @apollon77

        Ich hab gerade den Slave (iobrokerNew) ebenfalls auf 4.0.3 aktualisiert.
        Danach hab ich mal den Master per iobroker stop ausgeschaltet. Der Slave meldet berechtigterweise

        host.ioBrokerNew Objects database error: connect ECONNREFUSED 192.168.178.77:9001 
        

        danach hab ich den Master wieder gestartet. Beim hochfahren war im Log folgende Warnungen / Fehler vom Master / Slave im Log

        05 Feb 2022 12:09:23.686
        iobrokerTestsystemSlave host.ioBrokerNew Could not execute primary host determination: Error Unknown Script b0bd9e6fd92479ccf43654a7ba7443c915d0a742
        05 Feb 2022 12:09:23.683
        iobrokerTestsystemSlave host.ioBrokerNew Could not execute primary host determination: Error Unknown Script b0bd9e6fd92479ccf43654a7ba7443c915d0a742
        05 Feb 2022 12:09:23.678
        iobrokerTestsystem host.ioBrokerTestsystem-Server Objects 192.168.178.78:48414 Error from InMemDB: Error: Unknown Script b0bd9e6fd92479ccf43654a7ba7443c915d0a742
        05 Feb 2022 12:09:23.675
        iobrokerTestsystemSlave host.ioBrokerNew States database error: connect ECONNREFUSED 192.168.178.77:9000
        05 Feb 2022 12:09:23.675
        iobrokerTestsystem host.ioBrokerTestsystem-Server Objects 192.168.178.78:48414 Error from InMemDB: Error: Unknown Script b0bd9e6fd92479ccf43654a7ba7443c915d0a742 
        

        Vollständiges Log:

        05 Feb 2022 12:09:30.646
        iobrokerTestsystem admin.0 (26234) requesting all objects
        05 Feb 2022 12:09:30.644
        iobrokerTestsystem admin.0 (26234) requesting all states
        05 Feb 2022 12:09:30.554
        iobrokerTestsystem admin.0 (26234) starting. Version 5.2.3 in /opt/iobroker/node_modules/iobroker.admin, node: v14.19.0, js-controller: 4.0.3
        05 Feb 2022 12:09:30.327
        iobrokerTestsystem host.ioBrokerTestsystem instance system.adapter.javascript.0 started with pid 26245
        05 Feb 2022 12:09:28.683
        iobrokerTestsystemSlave host.ioBrokerNew Objects database successfully reconnected
        05 Feb 2022 12:09:26.363
        iobrokerTestsystem host.ioBrokerTestsystem instance system.adapter.admin.0 started with pid 26234
        05 Feb 2022 12:09:26.110
        iobrokerTestsystem host.ioBrokerTestsystem starting 29 instances
        05 Feb 2022 12:09:25.968
        iobrokerTestsystem host.ioBrokerTestsystem 58 instances found
        05 Feb 2022 12:09:24.957
        iobrokerTestsystem host.ioBrokerTestsystem added notifications configuration of host
        05 Feb 2022 12:09:24.923
        iobrokerTestsystem host.ioBrokerTestsystem connected to Objects and States
        05 Feb 2022 12:09:23.686
        iobrokerTestsystemSlave host.ioBrokerNew Could not execute primary host determination: Error Unknown Script b0bd9e6fd92479ccf43654a7ba7443c915d0a742
        05 Feb 2022 12:09:23.683
        iobrokerTestsystemSlave host.ioBrokerNew Could not execute primary host determination: Error Unknown Script b0bd9e6fd92479ccf43654a7ba7443c915d0a742
        05 Feb 2022 12:09:23.678
        iobrokerTestsystem host.ioBrokerTestsystem-Server Objects 192.168.178.78:48414 Error from InMemDB: Error: Unknown Script b0bd9e6fd92479ccf43654a7ba7443c915d0a742
        05 Feb 2022 12:09:23.675
        iobrokerTestsystemSlave host.ioBrokerNew States database error: connect ECONNREFUSED 192.168.178.77:9000
        05 Feb 2022 12:09:23.675
        iobrokerTestsystem host.ioBrokerTestsystem-Server Objects 192.168.178.78:48414 Error from InMemDB: Error: Unknown Script b0bd9e6fd92479ccf43654a7ba7443c915d0a742
        05 Feb 2022 12:09:23.585
        iobrokerTestsystemSlave host.ioBrokerNew Objects database successfully reconnected
        05 Feb 2022 12:09:22.215
        iobrokerTestsystem host.ioBrokerTestsystem ip addresses: 192.168.178.77 fe80::f854:cfff:fe5f:6c25
        05 Feb 2022 12:09:22.212
        iobrokerTestsystem host.ioBrokerTestsystem hostname: ioBrokerTestsystem, node: v14.19.0
        05 Feb 2022 12:09:22.210
        iobrokerTestsystem host.ioBrokerTestsystem Copyright (c) 2014-2022 bluefox, 2014 hobbyquaker
        05 Feb 2022 12:09:22.204
        iobrokerTestsystem host.ioBrokerTestsystem iobroker.js-controller version 4.0.3 js-controller starting
        05 Feb 2022 12:09:18.668
        iobrokerTestsystemSlave host.ioBrokerNew States database error: connect ECONNREFUSED 192.168.178.77:9000
        05 Feb 2022 12:09:18.576
        iobrokerTestsystemSlave host.ioBrokerNew Objects database error: connect ECONNREFUSED 192.168.178.77:9001
        05 Feb 2022 12:09:13.660
        iobrokerTestsystemSlave host.ioBrokerNew States database error: connect ECONNREFUSED 192.168.178.77:9000
        05 Feb 2022 12:09:13.569
        iobrokerTestsystemSlave host.ioBrokerNew Objects database error: connect ECONNREFUSED 192.168.178.77:9001 
        
        apollon77A Offline
        apollon77A Offline
        apollon77
        schrieb am zuletzt editiert von
        #188

        @feuersturm aber danach tat alles oder? Mach auch mal issue. Schauen wir uns an.

        Beitrag hat geholfen? Votet rechts unten im Beitrag :-) https://paypal.me/Apollon77 / https://github.com/sponsors/Apollon77

        • Debug-Log für Instanz einschalten? Admin -> Instanzen -> Expertenmodus -> Instanz aufklappen - Loglevel ändern
        • Logfiles auf Platte /opt/iobroker/log/… nutzen, Admin schneidet Zeilen ab
        1 Antwort Letzte Antwort
        0
        • foxriver76F foxriver76

          @lonsimbt sagte in Alpha Test js-controller 4.0:

          Beide Adapter sind zzt. nicht in Benutzung. Können die Ordner tatsächlich gefahrlos gelöscht werden?

          Ich vermute die Adapter sind derzeit nicht mal installiert?

          L Offline
          L Offline
          lonsimbt
          schrieb am zuletzt editiert von
          #189

          @foxriver76 sagte in Alpha Test js-controller 4.0:

          @lonsimbt sagte in Alpha Test js-controller 4.0:

          Beide Adapter sind zzt. nicht in Benutzung. Können die Ordner tatsächlich gefahrlos gelöscht werden?

          Ich vermute die Adapter sind derzeit nicht mal installiert?

          Doch sind beide installiert und haben Instanzen, sind zzt. aber pausiert, weil zzt. leider noch kein Mähroboter noch Gartenbewässerungssaison ist.

          iobroker im Container (debian Bullseye) unter proxmox 7.1
          debmatic in VM (debian Buster) unter proxmox 7.1 mit HB-RF-USB und RPI-RF-MOD
          40 HomeMatic Geräte, Phillips Hue, Ikea Tradfri, Logitech Harmony Hub, Botvac Connected, Robonect

          foxriver76F 1 Antwort Letzte Antwort
          1
          • L lonsimbt

            @foxriver76 sagte in Alpha Test js-controller 4.0:

            @lonsimbt sagte in Alpha Test js-controller 4.0:

            Beide Adapter sind zzt. nicht in Benutzung. Können die Ordner tatsächlich gefahrlos gelöscht werden?

            Ich vermute die Adapter sind derzeit nicht mal installiert?

            Doch sind beide installiert und haben Instanzen, sind zzt. aber pausiert, weil zzt. leider noch kein Mähroboter noch Gartenbewässerungssaison ist.

            foxriver76F Offline
            foxriver76F Offline
            foxriver76
            Developer
            schrieb am zuletzt editiert von
            #190

            @lonsimbt dann mal die beiden Adapter uploaden, dann sollten die Objekte erstellt werden.

            Videotutorials & mehr

            Hier könnt ihr mich unterstützen.

            1 Antwort Letzte Antwort
            1
            • wendy2702W Offline
              wendy2702W Offline
              wendy2702
              schrieb am zuletzt editiert von
              #191

              @apollon77 @foxriver76 : 4.03 auf Master und beiden Slaves installiert.

              Master lief diesmal ohne die Access error durch.

              Auf einem Slave wo unter anderem der Smartmeter Adapter (Serialport) läuft sieht das log so aus:

              pi@pi-iobroker:/opt/iobroker $ npm i iobroker.js-controller@next
              npm WARN deprecated request@2.88.2: request has been deprecated, see https://github.com/request/request/issues/3142
              npm WARN deprecated har-validator@5.1.5: this library is no longer supported
              npm WARN deprecated uuid@3.4.0: Please upgrade  to version 7 or higher.  Older versions may use Math.random() in certain circumstances, which is known to be problematic.  See https://v8.dev/blog/math-random for details.
              
              > iobroker.js-controller@4.0.3 preinstall /opt/iobroker/node_modules/iobroker.js-controller
              > node lib/preinstallCheck.js
              
              NPM version: 6.14.16
              
              > unix-dgram@2.0.4 install /opt/iobroker/node_modules/unix-dgram
              > node-gyp rebuild
              
              make: Verzeichnis „/opt/iobroker/node_modules/unix-dgram/build“ wird betreten
               CXX(target) Release/obj.target/unix_dgram/src/unix_dgram.o
              In file included from ../src/unix_dgram.cc:5:
              ../../nan/nan.h: In function ‘void Nan::AsyncQueueWorker(Nan::AsyncWorker*)’:
              ../../nan/nan.h:2298:62: warning: cast between incompatible function types from ‘void (*)(uv_work_t*)’ {aka ‘void (*)(uv_work_s*)’} to ‘uv_after_work_cb’ {aka ‘void (*)(uv_work_s*, int)’} [-Wcast-function-type]
                  , reinterpret_cast<uv_after_work_cb>(AsyncExecuteComplete)
                                                                           ^
              In file included from ../../nan/nan.h:54,
                              from ../src/unix_dgram.cc:5:
              ../src/unix_dgram.cc: At global scope:
              /home/iobroker/.cache/node-gyp/14.19.0/include/node/node.h:793:43: warning: cast between incompatible function types from ‘void (*)(v8::Local<v8::Object>)’ to ‘node::addon_register_func’ {aka ‘void (*)(v8::Local<v8::Object>, v8::Local<v8::Value>, void*)’} [-Wcast-function-type]
                    (node::addon_register_func) (regfunc),                          \
                                                        ^
              /home/iobroker/.cache/node-gyp/14.19.0/include/node/node.h:827:3: note: in expansion of macro ‘NODE_MODULE_X’
                NODE_MODULE_X(modname, regfunc, NULL, 0)  // NOLINT (readability/null_usage)
                ^~~~~~~~~~~~~
              ../src/unix_dgram.cc:404:1: note: in expansion of macro ‘NODE_MODULE’
              NODE_MODULE(unix_dgram, Initialize)
              ^~~~~~~~~~~
               SOLINK_MODULE(target) Release/obj.target/unix_dgram.node
               COPY Release/unix_dgram.node
              make: Verzeichnis „/opt/iobroker/node_modules/unix-dgram/build“ wird verlassen
              
              > serialport@6.2.2 install /opt/iobroker/node_modules/smartmeter-obis/node_modules/serialport
              > prebuild-install || node-gyp rebuild
              
              prebuild-install WARN install No prebuilt binaries found (target=14.19.0 runtime=node arch=arm platform=linux)
              make: Verzeichnis „/opt/iobroker/node_modules/smartmeter-obis/node_modules/serialport/build“ wird betreten
               CXX(target) Release/obj.target/serialport/src/serialport.o
              In file included from ../src/./serialport.h:6,
                              from ../src/serialport.cpp:1:
              ../../../../nan/nan.h: In function ‘void Nan::AsyncQueueWorker(Nan::AsyncWorker*)’:
              ../../../../nan/nan.h:2298:62: warning: cast between incompatible function types from ‘void (*)(uv_work_t*)’ {aka ‘void (*)(uv_work_s*)’} to ‘uv_after_work_cb’ {aka ‘void (*)(uv_work_s*, int)’} [-Wcast-function-type]
                  , reinterpret_cast<uv_after_work_cb>(AsyncExecuteComplete)
                                                                           ^
              ../src/serialport.cpp: In function ‘Nan::NAN_METHOD_RETURN_TYPE Open(Nan::NAN_METHOD_ARGS_TYPE)’:
              ../src/serialport.cpp:41:48: error: no matching function for call to ‘v8::Value::ToString()’
                v8::String::Utf8Value path(info[0]->ToString());
                                                             ^
              In file included from /home/iobroker/.cache/node-gyp/14.19.0/include/node/node.h:67,
                              from ../../../../nan/nan.h:54,
                              from ../src/./serialport.h:6,
                              from ../src/serialport.cpp:1:
              /home/iobroker/.cache/node-gyp/14.19.0/include/node/v8.h:2810:44: note: candidate: ‘v8::MaybeLocal<v8::String> v8::Value::ToString(v8::Local<v8::Context>) const’
                V8_WARN_UNUSED_RESULT MaybeLocal<String> ToString(
                                                         ^~~~~~~~
              /home/iobroker/.cache/node-gyp/14.19.0/include/node/v8.h:2810:44: note:   candidate expects 1 argument, 0 provided
              ../src/serialport.cpp:48:53: error: no matching function for call to ‘v8::Value::ToObject()’
                v8::Local<v8::Object> options = info[1]->ToObject();
                                                                  ^
              In file included from /home/iobroker/.cache/node-gyp/14.19.0/include/node/node.h:67,
                              from ../../../../nan/nan.h:54,
                              from ../src/./serialport.h:6,
                              from ../src/serialport.cpp:1:
              /home/iobroker/.cache/node-gyp/14.19.0/include/node/v8.h:2822:44: note: candidate: ‘v8::MaybeLocal<v8::Object> v8::Value::ToObject(v8::Local<v8::Context>) const’
                V8_WARN_UNUSED_RESULT MaybeLocal<Object> ToObject(
                                                         ^~~~~~~~
              /home/iobroker/.cache/node-gyp/14.19.0/include/node/v8.h:2822:44: note:   candidate expects 1 argument, 0 provided
              ../src/serialport.cpp:78:69: warning: cast between incompatible function types from ‘void (*)(uv_work_t*)’ {aka ‘void (*)(uv_work_s*)’} to ‘uv_after_work_cb’ {aka ‘void (*)(uv_work_s*, int)’} [-Wcast-function-type]
                uv_queue_work(uv_default_loop(), req, EIO_Open, (uv_after_work_cb)EIO_AfterOpen);
                                                                                  ^~~~~~~~~~~~~
              ../src/serialport.cpp: In function ‘void EIO_AfterOpen(uv_work_t*)’:
              ../src/serialport.cpp:95:30: warning: ‘v8::Local<v8::Value> Nan::Callback::Call(int, v8::Local<v8::Value>*) const’ is deprecated [-Wdeprecated-declarations]
                data->callback.Call(2, argv);
                                           ^
              In file included from ../src/./serialport.h:6,
                              from ../src/serialport.cpp:1:
              ../../../../nan/nan.h:1740:3: note: declared here
                Call(int argc, v8::Local<v8::Value> argv[]) const {
                ^~~~
              ../src/serialport.cpp: In function ‘Nan::NAN_METHOD_RETURN_TYPE Update(Nan::NAN_METHOD_ARGS_TYPE)’:
              ../src/serialport.cpp:113:53: error: no matching function for call to ‘v8::Value::ToObject()’
                v8::Local<v8::Object> options = info[1]->ToObject();
                                                                  ^
              In file included from /home/iobroker/.cache/node-gyp/14.19.0/include/node/node.h:67,
                              from ../../../../nan/nan.h:54,
                              from ../src/./serialport.h:6,
                              from ../src/serialport.cpp:1:
              /home/iobroker/.cache/node-gyp/14.19.0/include/node/v8.h:2822:44: note: candidate: ‘v8::MaybeLocal<v8::Object> v8::Value::ToObject(v8::Local<v8::Context>) const’
                V8_WARN_UNUSED_RESULT MaybeLocal<Object> ToObject(
                                                         ^~~~~~~~
              /home/iobroker/.cache/node-gyp/14.19.0/include/node/v8.h:2822:44: note:   candidate expects 1 argument, 0 provided
              ../src/serialport.cpp:135:71: warning: cast between incompatible function types from ‘void (*)(uv_work_t*)’ {aka ‘void (*)(uv_work_s*)’} to ‘uv_after_work_cb’ {aka ‘void (*)(uv_work_s*, int)’} [-Wcast-function-type]
                uv_queue_work(uv_default_loop(), req, EIO_Update, (uv_after_work_cb)EIO_AfterUpdate);
                                                                                    ^~~~~~~~~~~~~~~
              ../src/serialport.cpp: In function ‘void EIO_AfterUpdate(uv_work_t*)’:
              ../src/serialport.cpp:150:30: warning: ‘v8::Local<v8::Value> Nan::Callback::Call(int, v8::Local<v8::Value>*) const’ is deprecated [-Wdeprecated-declarations]
                data->callback.Call(1, argv);
                                           ^
              In file included from ../src/./serialport.h:6,
                              from ../src/serialport.cpp:1:
              ../../../../nan/nan.h:1740:3: note: declared here
                Call(int argc, v8::Local<v8::Value> argv[]) const {
                ^~~~
              ../src/serialport.cpp: In function ‘Nan::NAN_METHOD_RETURN_TYPE Close(Nan::NAN_METHOD_ARGS_TYPE)’:
              ../src/serialport.cpp:175:70: warning: cast between incompatible function types from ‘void (*)(uv_work_t*)’ {aka ‘void (*)(uv_work_s*)’} to ‘uv_after_work_cb’ {aka ‘void (*)(uv_work_s*, int)’} [-Wcast-function-type]
                uv_queue_work(uv_default_loop(), req, EIO_Close, (uv_after_work_cb)EIO_AfterClose);
                                                                                   ^~~~~~~~~~~~~~
              ../src/serialport.cpp: In function ‘void EIO_AfterClose(uv_work_t*)’:
              ../src/serialport.cpp:188:30: warning: ‘v8::Local<v8::Value> Nan::Callback::Call(int, v8::Local<v8::Value>*) const’ is deprecated [-Wdeprecated-declarations]
                data->callback.Call(1, argv);
                                           ^
              In file included from ../src/./serialport.h:6,
                              from ../src/serialport.cpp:1:
              ../../../../nan/nan.h:1740:3: note: declared here
                Call(int argc, v8::Local<v8::Value> argv[]) const {
                ^~~~
              ../src/serialport.cpp: In function ‘Nan::NAN_METHOD_RETURN_TYPE Flush(Nan::NAN_METHOD_ARGS_TYPE)’:
              ../src/serialport.cpp:215:70: warning: cast between incompatible function types from ‘void (*)(uv_work_t*)’ {aka ‘void (*)(uv_work_s*)’} to ‘uv_after_work_cb’ {aka ‘void (*)(uv_work_s*, int)’} [-Wcast-function-type]
                uv_queue_work(uv_default_loop(), req, EIO_Flush, (uv_after_work_cb)EIO_AfterFlush);
                                                                                   ^~~~~~~~~~~~~~
              ../src/serialport.cpp: In function ‘void EIO_AfterFlush(uv_work_t*)’:
              ../src/serialport.cpp:231:30: warning: ‘v8::Local<v8::Value> Nan::Callback::Call(int, v8::Local<v8::Value>*) const’ is deprecated [-Wdeprecated-declarations]
                data->callback.Call(1, argv);
                                           ^
              In file included from ../src/./serialport.h:6,
                              from ../src/serialport.cpp:1:
              ../../../../nan/nan.h:1740:3: note: declared here
                Call(int argc, v8::Local<v8::Value> argv[]) const {
                ^~~~
              ../src/serialport.cpp: In function ‘Nan::NAN_METHOD_RETURN_TYPE Set(Nan::NAN_METHOD_ARGS_TYPE)’:
              ../src/serialport.cpp:250:53: error: no matching function for call to ‘v8::Value::ToObject()’
                v8::Local<v8::Object> options = info[1]->ToObject();
                                                                  ^
              In file included from /home/iobroker/.cache/node-gyp/14.19.0/include/node/node.h:67,
                              from ../../../../nan/nan.h:54,
                              from ../src/./serialport.h:6,
                              from ../src/serialport.cpp:1:
              /home/iobroker/.cache/node-gyp/14.19.0/include/node/v8.h:2822:44: note: candidate: ‘v8::MaybeLocal<v8::Object> v8::Value::ToObject(v8::Local<v8::Context>) const’
                V8_WARN_UNUSED_RESULT MaybeLocal<Object> ToObject(
                                                         ^~~~~~~~
              /home/iobroker/.cache/node-gyp/14.19.0/include/node/v8.h:2822:44: note:   candidate expects 1 argument, 0 provided
              ../src/serialport.cpp:270:68: warning: cast between incompatible function types from ‘void (*)(uv_work_t*)’ {aka ‘void (*)(uv_work_s*)’} to ‘uv_after_work_cb’ {aka ‘void (*)(uv_work_s*, int)’} [-Wcast-function-type]
                uv_queue_work(uv_default_loop(), req, EIO_Set, (uv_after_work_cb)EIO_AfterSet);
                                                                                 ^~~~~~~~~~~~
              ../src/serialport.cpp: In function ‘void EIO_AfterSet(uv_work_t*)’:
              ../src/serialport.cpp:285:30: warning: ‘v8::Local<v8::Value> Nan::Callback::Call(int, v8::Local<v8::Value>*) const’ is deprecated [-Wdeprecated-declarations]
                data->callback.Call(1, argv);
                                           ^
              In file included from ../src/./serialport.h:6,
                              from ../src/serialport.cpp:1:
              ../../../../nan/nan.h:1740:3: note: declared here
                Call(int argc, v8::Local<v8::Value> argv[]) const {
                ^~~~
              ../src/serialport.cpp: In function ‘Nan::NAN_METHOD_RETURN_TYPE Get(Nan::NAN_METHOD_ARGS_TYPE)’:
              ../src/serialport.cpp:314:68: warning: cast between incompatible function types from ‘void (*)(uv_work_t*)’ {aka ‘void (*)(uv_work_s*)’} to ‘uv_after_work_cb’ {aka ‘void (*)(uv_work_s*, int)’} [-Wcast-function-type]
                uv_queue_work(uv_default_loop(), req, EIO_Get, (uv_after_work_cb)EIO_AfterGet);
                                                                                 ^~~~~~~~~~~~
              ../src/serialport.cpp: In function ‘void EIO_AfterGet(uv_work_t*)’:
              ../src/serialport.cpp:329:96: error: no matching function for call to ‘v8::Object::Set(v8::Local<v8::String>, Nan::imp::FactoryBase<v8::Boolean>::return_t)’
                  results->Set(Nan::New<v8::String>("cts").ToLocalChecked(), Nan::New<v8::Boolean>(data->cts));
                                                                                                             ^
              In file included from /home/iobroker/.cache/node-gyp/14.19.0/include/node/node.h:67,
                              from ../../../../nan/nan.h:54,
                              from ../src/./serialport.h:6,
                              from ../src/serialport.cpp:1:
              /home/iobroker/.cache/node-gyp/14.19.0/include/node/v8.h:3670:37: note: candidate: ‘v8::Maybe<bool> v8::Object::Set(v8::Local<v8::Context>, v8::Local<v8::Value>, v8::Local<v8::Value>)’
                V8_WARN_UNUSED_RESULT Maybe<bool> Set(Local<Context> context,
                                                  ^~~
              /home/iobroker/.cache/node-gyp/14.19.0/include/node/v8.h:3670:37: note:   candidate expects 3 arguments, 2 provided
              /home/iobroker/.cache/node-gyp/14.19.0/include/node/v8.h:3673:37: note: candidate: ‘v8::Maybe<bool> v8::Object::Set(v8::Local<v8::Context>, uint32_t, v8::Local<v8::Value>)’
                V8_WARN_UNUSED_RESULT Maybe<bool> Set(Local<Context> context, uint32_t index,
                                                  ^~~
              /home/iobroker/.cache/node-gyp/14.19.0/include/node/v8.h:3673:37: note:   candidate expects 3 arguments, 2 provided
              ../src/serialport.cpp:330:96: error: no matching function for call to ‘v8::Object::Set(v8::Local<v8::String>, Nan::imp::FactoryBase<v8::Boolean>::return_t)’
                  results->Set(Nan::New<v8::String>("dsr").ToLocalChecked(), Nan::New<v8::Boolean>(data->dsr));
                                                                                                             ^
              In file included from /home/iobroker/.cache/node-gyp/14.19.0/include/node/node.h:67,
                              from ../../../../nan/nan.h:54,
                              from ../src/./serialport.h:6,
                              from ../src/serialport.cpp:1:
              /home/iobroker/.cache/node-gyp/14.19.0/include/node/v8.h:3670:37: note: candidate: ‘v8::Maybe<bool> v8::Object::Set(v8::Local<v8::Context>, v8::Local<v8::Value>, v8::Local<v8::Value>)’
                V8_WARN_UNUSED_RESULT Maybe<bool> Set(Local<Context> context,
                                                  ^~~
              /home/iobroker/.cache/node-gyp/14.19.0/include/node/v8.h:3670:37: note:   candidate expects 3 arguments, 2 provided
              /home/iobroker/.cache/node-gyp/14.19.0/include/node/v8.h:3673:37: note: candidate: ‘v8::Maybe<bool> v8::Object::Set(v8::Local<v8::Context>, uint32_t, v8::Local<v8::Value>)’
                V8_WARN_UNUSED_RESULT Maybe<bool> Set(Local<Context> context, uint32_t index,
                                                  ^~~
              /home/iobroker/.cache/node-gyp/14.19.0/include/node/v8.h:3673:37: note:   candidate expects 3 arguments, 2 provided
              ../src/serialport.cpp:331:96: error: no matching function for call to ‘v8::Object::Set(v8::Local<v8::String>, Nan::imp::FactoryBase<v8::Boolean>::return_t)’
                  results->Set(Nan::New<v8::String>("dcd").ToLocalChecked(), Nan::New<v8::Boolean>(data->dcd));
                                                                                                             ^
              In file included from /home/iobroker/.cache/node-gyp/14.19.0/include/node/node.h:67,
                              from ../../../../nan/nan.h:54,
                              from ../src/./serialport.h:6,
                              from ../src/serialport.cpp:1:
              /home/iobroker/.cache/node-gyp/14.19.0/include/node/v8.h:3670:37: note: candidate: ‘v8::Maybe<bool> v8::Object::Set(v8::Local<v8::Context>, v8::Local<v8::Value>, v8::Local<v8::Value>)’
                V8_WARN_UNUSED_RESULT Maybe<bool> Set(Local<Context> context,
                                                  ^~~
              /home/iobroker/.cache/node-gyp/14.19.0/include/node/v8.h:3670:37: note:   candidate expects 3 arguments, 2 provided
              /home/iobroker/.cache/node-gyp/14.19.0/include/node/v8.h:3673:37: note: candidate: ‘v8::Maybe<bool> v8::Object::Set(v8::Local<v8::Context>, uint32_t, v8::Local<v8::Value>)’
                V8_WARN_UNUSED_RESULT Maybe<bool> Set(Local<Context> context, uint32_t index,
                                                  ^~~
              /home/iobroker/.cache/node-gyp/14.19.0/include/node/v8.h:3673:37: note:   candidate expects 3 arguments, 2 provided
              ../src/serialport.cpp:336:30: warning: ‘v8::Local<v8::Value> Nan::Callback::Call(int, v8::Local<v8::Value>*) const’ is deprecated [-Wdeprecated-declarations]
                data->callback.Call(2, argv);
                                           ^
              In file included from ../src/./serialport.h:6,
                              from ../src/serialport.cpp:1:
              ../../../../nan/nan.h:1740:3: note: declared here
                Call(int argc, v8::Local<v8::Value> argv[]) const {
                ^~~~
              ../src/serialport.cpp: In function ‘Nan::NAN_METHOD_RETURN_TYPE GetBaudRate(Nan::NAN_METHOD_ARGS_TYPE)’:
              ../src/serialport.cpp:363:76: warning: cast between incompatible function types from ‘void (*)(uv_work_t*)’ {aka ‘void (*)(uv_work_s*)’} to ‘uv_after_work_cb’ {aka ‘void (*)(uv_work_s*, int)’} [-Wcast-function-type]
                uv_queue_work(uv_default_loop(), req, EIO_GetBaudRate, (uv_after_work_cb)EIO_AfterGetBaudRate);
                                                                                         ^~~~~~~~~~~~~~~~~~~~
              ../src/serialport.cpp: In function ‘void EIO_AfterGetBaudRate(uv_work_t*)’:
              ../src/serialport.cpp:378:106: error: no matching function for call to ‘v8::Object::Set(v8::Local<v8::String>, Nan::imp::IntegerFactory<v8::Integer>::return_t)’
                  results->Set(Nan::New<v8::String>("baudRate").ToLocalChecked(), Nan::New<v8::Integer>(data->baudRate));
                                                                                                                       ^
              In file included from /home/iobroker/.cache/node-gyp/14.19.0/include/node/node.h:67,
                              from ../../../../nan/nan.h:54,
                              from ../src/./serialport.h:6,
                              from ../src/serialport.cpp:1:
              /home/iobroker/.cache/node-gyp/14.19.0/include/node/v8.h:3670:37: note: candidate: ‘v8::Maybe<bool> v8::Object::Set(v8::Local<v8::Context>, v8::Local<v8::Value>, v8::Local<v8::Value>)’
                V8_WARN_UNUSED_RESULT Maybe<bool> Set(Local<Context> context,
                                                  ^~~
              /home/iobroker/.cache/node-gyp/14.19.0/include/node/v8.h:3670:37: note:   candidate expects 3 arguments, 2 provided
              /home/iobroker/.cache/node-gyp/14.19.0/include/node/v8.h:3673:37: note: candidate: ‘v8::Maybe<bool> v8::Object::Set(v8::Local<v8::Context>, uint32_t, v8::Local<v8::Value>)’
                V8_WARN_UNUSED_RESULT Maybe<bool> Set(Local<Context> context, uint32_t index,
                                                  ^~~
              /home/iobroker/.cache/node-gyp/14.19.0/include/node/v8.h:3673:37: note:   candidate expects 3 arguments, 2 provided
              ../src/serialport.cpp:383:30: warning: ‘v8::Local<v8::Value> Nan::Callback::Call(int, v8::Local<v8::Value>*) const’ is deprecated [-Wdeprecated-declarations]
                data->callback.Call(2, argv);
                                           ^
              In file included from ../src/./serialport.h:6,
                              from ../src/serialport.cpp:1:
              ../../../../nan/nan.h:1740:3: note: declared here
                Call(int argc, v8::Local<v8::Value> argv[]) const {
                ^~~~
              ../src/serialport.cpp: In function ‘Nan::NAN_METHOD_RETURN_TYPE Drain(Nan::NAN_METHOD_ARGS_TYPE)’:
              ../src/serialport.cpp:409:70: warning: cast between incompatible function types from ‘void (*)(uv_work_t*)’ {aka ‘void (*)(uv_work_s*)’} to ‘uv_after_work_cb’ {aka ‘void (*)(uv_work_s*, int)’} [-Wcast-function-type]
                uv_queue_work(uv_default_loop(), req, EIO_Drain, (uv_after_work_cb)EIO_AfterDrain);
                                                                                   ^~~~~~~~~~~~~~
              ../src/serialport.cpp: In function ‘void EIO_AfterDrain(uv_work_t*)’:
              ../src/serialport.cpp:424:30: warning: ‘v8::Local<v8::Value> Nan::Callback::Call(int, v8::Local<v8::Value>*) const’ is deprecated [-Wdeprecated-declarations]
                data->callback.Call(1, argv);
                                           ^
              In file included from ../src/./serialport.h:6,
                              from ../src/serialport.cpp:1:
              ../../../../nan/nan.h:1740:3: note: declared here
                Call(int argc, v8::Local<v8::Value> argv[]) const {
                ^~~~
              ../src/serialport.cpp: At global scope:
              ../src/serialport.cpp:430:28: warning: unnecessary parentheses in declaration of ‘ToParityEnum’ [-Wparentheses]
              SerialPortParity NAN_INLINE(ToParityEnum(const v8::Local<v8::String>& v8str)) {
                                         ^
              ../src/serialport.cpp:449:30: warning: unnecessary parentheses in declaration of ‘ToStopBitEnum’ [-Wparentheses]
              SerialPortStopBits NAN_INLINE(ToStopBitEnum(double stopBits)) {
                                           ^
              ../src/serialport.cpp:460:17: error: variable or field ‘init’ declared void
                void init(v8::Handle<v8::Object> target) {
                              ^~~~~~
              ../src/serialport.cpp:460:17: error: ‘Handle’ is not a member of ‘v8’
              ../src/serialport.cpp:460:17: note: suggested alternative: ‘JobHandle’
                void init(v8::Handle<v8::Object> target) {
                              ^~~~~~
                              JobHandle
              ../src/serialport.cpp:460:34: error: expected primary-expression before ‘>’ token
                void init(v8::Handle<v8::Object> target) {
                                               ^
              ../src/serialport.cpp:460:36: error: ‘target’ was not declared in this scope
                void init(v8::Handle<v8::Object> target) {
                                                 ^~~~~~
              ../src/serialport.cpp:460:36: note: suggested alternative: ‘tzset’
                void init(v8::Handle<v8::Object> target) {
                                                 ^~~~~~
                                                 tzset
              In file included from ../../../../nan/nan.h:54,
                              from ../src/./serialport.h:6,
                              from ../src/serialport.cpp:1:
              ../src/serialport.cpp:485:25: error: ‘init’ was not declared in this scope
              NODE_MODULE(serialport, init);
                                      ^~~~
              /home/iobroker/.cache/node-gyp/14.19.0/include/node/node.h:793:36: note: in definition of macro ‘NODE_MODULE_X’
                    (node::addon_register_func) (regfunc),                          \
                                                 ^~~~~~~
              ../src/serialport.cpp:485:1: note: in expansion of macro ‘NODE_MODULE’
              NODE_MODULE(serialport, init);
              ^~~~~~~~~~~
              ../src/serialport.cpp:485:25: note: suggested alternative: ‘int’
              NODE_MODULE(serialport, init);
                                      ^~~~
              /home/iobroker/.cache/node-gyp/14.19.0/include/node/node.h:793:36: note: in definition of macro ‘NODE_MODULE_X’
                    (node::addon_register_func) (regfunc),                          \
                                                 ^~~~~~~
              ../src/serialport.cpp:485:1: note: in expansion of macro ‘NODE_MODULE’
              NODE_MODULE(serialport, init);
              ^~~~~~~~~~~
              make: *** [serialport.target.mk:112: Release/obj.target/serialport/src/serialport.o] Fehler 1
              make: Verzeichnis „/opt/iobroker/node_modules/smartmeter-obis/node_modules/serialport/build“ wird verlassen
              gyp ERR! build error
              gyp ERR! stack Error: `make` failed with exit code: 2
              gyp ERR! stack     at ChildProcess.onExit (/usr/lib/node_modules/npm/node_modules/node-gyp/lib/build.js:194:23)
              gyp ERR! stack     at ChildProcess.emit (events.js:400:28)
              gyp ERR! stack     at Process.ChildProcess._handle.onexit (internal/child_process.js:282:12)
              gyp ERR! System Linux 5.10.63-v7+
              gyp ERR! command "/usr/bin/node" "/usr/lib/node_modules/npm/node_modules/node-gyp/bin/node-gyp.js" "rebuild"
              gyp ERR! cwd /opt/iobroker/node_modules/smartmeter-obis/node_modules/serialport
              gyp ERR! node -v v14.19.0
              gyp ERR! node-gyp -v v5.1.0
              gyp ERR! not ok
              
              > iobroker.js-controller@4.0.3 install /opt/iobroker/node_modules/iobroker.js-controller
              > node iobroker.js setup first
              
              object _design/system updated
              {
               "defaultPrivate": "-----BEGIN RSA PRIVATE KEY-----\r\nMIIEogIBAAKxxxxxxTg7QV0OQyys=\r\n-----END RSA PRIVATE KEY-----\r\n",
               "defaultPublic": "-----BEGIN CERTIFICATE-----\r\nMIIDhxxxxVq+7jnSy02opY\r\n-----END CERTIFICATE-----\r\n"
              }
              Update certificate defaultPrivate
              The object "system.certificates" was updated successfully.
              Update certificate defaultPublic
              The object "system.certificates" was updated successfully.
              npm WARN optional SKIPPING OPTIONAL DEPENDENCY: fsevents@~2.3.2 (node_modules/@iobroker/js-controller-cli/node_modules/chokidar/node_modules/fsevents):
              npm WARN notsup SKIPPING OPTIONAL DEPENDENCY: Unsupported platform for fsevents@2.3.2: wanted {"os":"darwin","arch":"any"} (current: {"os":"linux","arch":"arm"})
              npm WARN optional SKIPPING OPTIONAL DEPENDENCY: serialport@6.2.2 (node_modules/smartmeter-obis/node_modules/serialport):
              npm WARN optional SKIPPING OPTIONAL DEPENDENCY: serialport@6.2.2 install: `prebuild-install || node-gyp rebuild`
              npm WARN optional SKIPPING OPTIONAL DEPENDENCY: Exit status 1
              
              + iobroker.js-controller@4.0.3
              updated 14 packages in 237.614s
              
              60 packages are looking for funding
               run `npm fund` for details
              
              pi@pi-iobroker:/opt/iobroker $
              
              

              HIer mal zwei Auszüge:

              npm WARN deprecated request@2.88.2: request has been deprecated, see https://github.com/request/request/issues/3142
              npm WARN deprecated har-validator@5.1.5: this library is no longer supported
              npm WARN deprecated uuid@3.4.0: Please upgrade  to version 7 or higher.  Older versions may use Math.random() in certain circumstances, which is known to be problematic.  See https://v8.dev/blog/math-random for details.
              
              

              und

              make: *** [serialport.target.mk:112: Release/obj.target/serialport/src/serialport.o] Fehler 1
              make: Verzeichnis „/opt/iobroker/node_modules/smartmeter-obis/node_modules/serialport/build“ wird verlassen
              gyp ERR! build error
              gyp ERR! stack Error: `make` failed with exit code: 2
              gyp ERR! stack     at ChildProcess.onExit (/usr/lib/node_modules/npm/node_modules/node-gyp/lib/build.js:194:23)
              gyp ERR! stack     at ChildProcess.emit (events.js:400:28)
              gyp ERR! stack     at Process.ChildProcess._handle.onexit (internal/child_process.js:282:12)
              gyp ERR! System Linux 5.10.63-v7+
              gyp ERR! command "/usr/bin/node" "/usr/lib/node_modules/npm/node_modules/node-gyp/bin/node-gyp.js" "rebuild"
              gyp ERR! cwd /opt/iobroker/node_modules/smartmeter-obis/node_modules/serialport
              gyp ERR! node -v v14.19.0
              gyp ERR! node-gyp -v v5.1.0
              gyp ERR! not ok
              

              Empfehlungen?

              Was/kann/muss ich machen damit das Forum hier nicht "Github" issues verlinkt ?

              Bitte keine Fragen per PN, die gehören ins Forum!

              Benutzt das Voting rechts unten im Beitrag wenn er euch geholfen hat.

              apollon77A 1 Antwort Letzte Antwort
              0
              • wendy2702W wendy2702

                @apollon77 @foxriver76 : 4.03 auf Master und beiden Slaves installiert.

                Master lief diesmal ohne die Access error durch.

                Auf einem Slave wo unter anderem der Smartmeter Adapter (Serialport) läuft sieht das log so aus:

                pi@pi-iobroker:/opt/iobroker $ npm i iobroker.js-controller@next
                npm WARN deprecated request@2.88.2: request has been deprecated, see https://github.com/request/request/issues/3142
                npm WARN deprecated har-validator@5.1.5: this library is no longer supported
                npm WARN deprecated uuid@3.4.0: Please upgrade  to version 7 or higher.  Older versions may use Math.random() in certain circumstances, which is known to be problematic.  See https://v8.dev/blog/math-random for details.
                
                > iobroker.js-controller@4.0.3 preinstall /opt/iobroker/node_modules/iobroker.js-controller
                > node lib/preinstallCheck.js
                
                NPM version: 6.14.16
                
                > unix-dgram@2.0.4 install /opt/iobroker/node_modules/unix-dgram
                > node-gyp rebuild
                
                make: Verzeichnis „/opt/iobroker/node_modules/unix-dgram/build“ wird betreten
                 CXX(target) Release/obj.target/unix_dgram/src/unix_dgram.o
                In file included from ../src/unix_dgram.cc:5:
                ../../nan/nan.h: In function ‘void Nan::AsyncQueueWorker(Nan::AsyncWorker*)’:
                ../../nan/nan.h:2298:62: warning: cast between incompatible function types from ‘void (*)(uv_work_t*)’ {aka ‘void (*)(uv_work_s*)’} to ‘uv_after_work_cb’ {aka ‘void (*)(uv_work_s*, int)’} [-Wcast-function-type]
                    , reinterpret_cast<uv_after_work_cb>(AsyncExecuteComplete)
                                                                             ^
                In file included from ../../nan/nan.h:54,
                                from ../src/unix_dgram.cc:5:
                ../src/unix_dgram.cc: At global scope:
                /home/iobroker/.cache/node-gyp/14.19.0/include/node/node.h:793:43: warning: cast between incompatible function types from ‘void (*)(v8::Local<v8::Object>)’ to ‘node::addon_register_func’ {aka ‘void (*)(v8::Local<v8::Object>, v8::Local<v8::Value>, void*)’} [-Wcast-function-type]
                      (node::addon_register_func) (regfunc),                          \
                                                          ^
                /home/iobroker/.cache/node-gyp/14.19.0/include/node/node.h:827:3: note: in expansion of macro ‘NODE_MODULE_X’
                  NODE_MODULE_X(modname, regfunc, NULL, 0)  // NOLINT (readability/null_usage)
                  ^~~~~~~~~~~~~
                ../src/unix_dgram.cc:404:1: note: in expansion of macro ‘NODE_MODULE’
                NODE_MODULE(unix_dgram, Initialize)
                ^~~~~~~~~~~
                 SOLINK_MODULE(target) Release/obj.target/unix_dgram.node
                 COPY Release/unix_dgram.node
                make: Verzeichnis „/opt/iobroker/node_modules/unix-dgram/build“ wird verlassen
                
                > serialport@6.2.2 install /opt/iobroker/node_modules/smartmeter-obis/node_modules/serialport
                > prebuild-install || node-gyp rebuild
                
                prebuild-install WARN install No prebuilt binaries found (target=14.19.0 runtime=node arch=arm platform=linux)
                make: Verzeichnis „/opt/iobroker/node_modules/smartmeter-obis/node_modules/serialport/build“ wird betreten
                 CXX(target) Release/obj.target/serialport/src/serialport.o
                In file included from ../src/./serialport.h:6,
                                from ../src/serialport.cpp:1:
                ../../../../nan/nan.h: In function ‘void Nan::AsyncQueueWorker(Nan::AsyncWorker*)’:
                ../../../../nan/nan.h:2298:62: warning: cast between incompatible function types from ‘void (*)(uv_work_t*)’ {aka ‘void (*)(uv_work_s*)’} to ‘uv_after_work_cb’ {aka ‘void (*)(uv_work_s*, int)’} [-Wcast-function-type]
                    , reinterpret_cast<uv_after_work_cb>(AsyncExecuteComplete)
                                                                             ^
                ../src/serialport.cpp: In function ‘Nan::NAN_METHOD_RETURN_TYPE Open(Nan::NAN_METHOD_ARGS_TYPE)’:
                ../src/serialport.cpp:41:48: error: no matching function for call to ‘v8::Value::ToString()’
                  v8::String::Utf8Value path(info[0]->ToString());
                                                               ^
                In file included from /home/iobroker/.cache/node-gyp/14.19.0/include/node/node.h:67,
                                from ../../../../nan/nan.h:54,
                                from ../src/./serialport.h:6,
                                from ../src/serialport.cpp:1:
                /home/iobroker/.cache/node-gyp/14.19.0/include/node/v8.h:2810:44: note: candidate: ‘v8::MaybeLocal<v8::String> v8::Value::ToString(v8::Local<v8::Context>) const’
                  V8_WARN_UNUSED_RESULT MaybeLocal<String> ToString(
                                                           ^~~~~~~~
                /home/iobroker/.cache/node-gyp/14.19.0/include/node/v8.h:2810:44: note:   candidate expects 1 argument, 0 provided
                ../src/serialport.cpp:48:53: error: no matching function for call to ‘v8::Value::ToObject()’
                  v8::Local<v8::Object> options = info[1]->ToObject();
                                                                    ^
                In file included from /home/iobroker/.cache/node-gyp/14.19.0/include/node/node.h:67,
                                from ../../../../nan/nan.h:54,
                                from ../src/./serialport.h:6,
                                from ../src/serialport.cpp:1:
                /home/iobroker/.cache/node-gyp/14.19.0/include/node/v8.h:2822:44: note: candidate: ‘v8::MaybeLocal<v8::Object> v8::Value::ToObject(v8::Local<v8::Context>) const’
                  V8_WARN_UNUSED_RESULT MaybeLocal<Object> ToObject(
                                                           ^~~~~~~~
                /home/iobroker/.cache/node-gyp/14.19.0/include/node/v8.h:2822:44: note:   candidate expects 1 argument, 0 provided
                ../src/serialport.cpp:78:69: warning: cast between incompatible function types from ‘void (*)(uv_work_t*)’ {aka ‘void (*)(uv_work_s*)’} to ‘uv_after_work_cb’ {aka ‘void (*)(uv_work_s*, int)’} [-Wcast-function-type]
                  uv_queue_work(uv_default_loop(), req, EIO_Open, (uv_after_work_cb)EIO_AfterOpen);
                                                                                    ^~~~~~~~~~~~~
                ../src/serialport.cpp: In function ‘void EIO_AfterOpen(uv_work_t*)’:
                ../src/serialport.cpp:95:30: warning: ‘v8::Local<v8::Value> Nan::Callback::Call(int, v8::Local<v8::Value>*) const’ is deprecated [-Wdeprecated-declarations]
                  data->callback.Call(2, argv);
                                             ^
                In file included from ../src/./serialport.h:6,
                                from ../src/serialport.cpp:1:
                ../../../../nan/nan.h:1740:3: note: declared here
                  Call(int argc, v8::Local<v8::Value> argv[]) const {
                  ^~~~
                ../src/serialport.cpp: In function ‘Nan::NAN_METHOD_RETURN_TYPE Update(Nan::NAN_METHOD_ARGS_TYPE)’:
                ../src/serialport.cpp:113:53: error: no matching function for call to ‘v8::Value::ToObject()’
                  v8::Local<v8::Object> options = info[1]->ToObject();
                                                                    ^
                In file included from /home/iobroker/.cache/node-gyp/14.19.0/include/node/node.h:67,
                                from ../../../../nan/nan.h:54,
                                from ../src/./serialport.h:6,
                                from ../src/serialport.cpp:1:
                /home/iobroker/.cache/node-gyp/14.19.0/include/node/v8.h:2822:44: note: candidate: ‘v8::MaybeLocal<v8::Object> v8::Value::ToObject(v8::Local<v8::Context>) const’
                  V8_WARN_UNUSED_RESULT MaybeLocal<Object> ToObject(
                                                           ^~~~~~~~
                /home/iobroker/.cache/node-gyp/14.19.0/include/node/v8.h:2822:44: note:   candidate expects 1 argument, 0 provided
                ../src/serialport.cpp:135:71: warning: cast between incompatible function types from ‘void (*)(uv_work_t*)’ {aka ‘void (*)(uv_work_s*)’} to ‘uv_after_work_cb’ {aka ‘void (*)(uv_work_s*, int)’} [-Wcast-function-type]
                  uv_queue_work(uv_default_loop(), req, EIO_Update, (uv_after_work_cb)EIO_AfterUpdate);
                                                                                      ^~~~~~~~~~~~~~~
                ../src/serialport.cpp: In function ‘void EIO_AfterUpdate(uv_work_t*)’:
                ../src/serialport.cpp:150:30: warning: ‘v8::Local<v8::Value> Nan::Callback::Call(int, v8::Local<v8::Value>*) const’ is deprecated [-Wdeprecated-declarations]
                  data->callback.Call(1, argv);
                                             ^
                In file included from ../src/./serialport.h:6,
                                from ../src/serialport.cpp:1:
                ../../../../nan/nan.h:1740:3: note: declared here
                  Call(int argc, v8::Local<v8::Value> argv[]) const {
                  ^~~~
                ../src/serialport.cpp: In function ‘Nan::NAN_METHOD_RETURN_TYPE Close(Nan::NAN_METHOD_ARGS_TYPE)’:
                ../src/serialport.cpp:175:70: warning: cast between incompatible function types from ‘void (*)(uv_work_t*)’ {aka ‘void (*)(uv_work_s*)’} to ‘uv_after_work_cb’ {aka ‘void (*)(uv_work_s*, int)’} [-Wcast-function-type]
                  uv_queue_work(uv_default_loop(), req, EIO_Close, (uv_after_work_cb)EIO_AfterClose);
                                                                                     ^~~~~~~~~~~~~~
                ../src/serialport.cpp: In function ‘void EIO_AfterClose(uv_work_t*)’:
                ../src/serialport.cpp:188:30: warning: ‘v8::Local<v8::Value> Nan::Callback::Call(int, v8::Local<v8::Value>*) const’ is deprecated [-Wdeprecated-declarations]
                  data->callback.Call(1, argv);
                                             ^
                In file included from ../src/./serialport.h:6,
                                from ../src/serialport.cpp:1:
                ../../../../nan/nan.h:1740:3: note: declared here
                  Call(int argc, v8::Local<v8::Value> argv[]) const {
                  ^~~~
                ../src/serialport.cpp: In function ‘Nan::NAN_METHOD_RETURN_TYPE Flush(Nan::NAN_METHOD_ARGS_TYPE)’:
                ../src/serialport.cpp:215:70: warning: cast between incompatible function types from ‘void (*)(uv_work_t*)’ {aka ‘void (*)(uv_work_s*)’} to ‘uv_after_work_cb’ {aka ‘void (*)(uv_work_s*, int)’} [-Wcast-function-type]
                  uv_queue_work(uv_default_loop(), req, EIO_Flush, (uv_after_work_cb)EIO_AfterFlush);
                                                                                     ^~~~~~~~~~~~~~
                ../src/serialport.cpp: In function ‘void EIO_AfterFlush(uv_work_t*)’:
                ../src/serialport.cpp:231:30: warning: ‘v8::Local<v8::Value> Nan::Callback::Call(int, v8::Local<v8::Value>*) const’ is deprecated [-Wdeprecated-declarations]
                  data->callback.Call(1, argv);
                                             ^
                In file included from ../src/./serialport.h:6,
                                from ../src/serialport.cpp:1:
                ../../../../nan/nan.h:1740:3: note: declared here
                  Call(int argc, v8::Local<v8::Value> argv[]) const {
                  ^~~~
                ../src/serialport.cpp: In function ‘Nan::NAN_METHOD_RETURN_TYPE Set(Nan::NAN_METHOD_ARGS_TYPE)’:
                ../src/serialport.cpp:250:53: error: no matching function for call to ‘v8::Value::ToObject()’
                  v8::Local<v8::Object> options = info[1]->ToObject();
                                                                    ^
                In file included from /home/iobroker/.cache/node-gyp/14.19.0/include/node/node.h:67,
                                from ../../../../nan/nan.h:54,
                                from ../src/./serialport.h:6,
                                from ../src/serialport.cpp:1:
                /home/iobroker/.cache/node-gyp/14.19.0/include/node/v8.h:2822:44: note: candidate: ‘v8::MaybeLocal<v8::Object> v8::Value::ToObject(v8::Local<v8::Context>) const’
                  V8_WARN_UNUSED_RESULT MaybeLocal<Object> ToObject(
                                                           ^~~~~~~~
                /home/iobroker/.cache/node-gyp/14.19.0/include/node/v8.h:2822:44: note:   candidate expects 1 argument, 0 provided
                ../src/serialport.cpp:270:68: warning: cast between incompatible function types from ‘void (*)(uv_work_t*)’ {aka ‘void (*)(uv_work_s*)’} to ‘uv_after_work_cb’ {aka ‘void (*)(uv_work_s*, int)’} [-Wcast-function-type]
                  uv_queue_work(uv_default_loop(), req, EIO_Set, (uv_after_work_cb)EIO_AfterSet);
                                                                                   ^~~~~~~~~~~~
                ../src/serialport.cpp: In function ‘void EIO_AfterSet(uv_work_t*)’:
                ../src/serialport.cpp:285:30: warning: ‘v8::Local<v8::Value> Nan::Callback::Call(int, v8::Local<v8::Value>*) const’ is deprecated [-Wdeprecated-declarations]
                  data->callback.Call(1, argv);
                                             ^
                In file included from ../src/./serialport.h:6,
                                from ../src/serialport.cpp:1:
                ../../../../nan/nan.h:1740:3: note: declared here
                  Call(int argc, v8::Local<v8::Value> argv[]) const {
                  ^~~~
                ../src/serialport.cpp: In function ‘Nan::NAN_METHOD_RETURN_TYPE Get(Nan::NAN_METHOD_ARGS_TYPE)’:
                ../src/serialport.cpp:314:68: warning: cast between incompatible function types from ‘void (*)(uv_work_t*)’ {aka ‘void (*)(uv_work_s*)’} to ‘uv_after_work_cb’ {aka ‘void (*)(uv_work_s*, int)’} [-Wcast-function-type]
                  uv_queue_work(uv_default_loop(), req, EIO_Get, (uv_after_work_cb)EIO_AfterGet);
                                                                                   ^~~~~~~~~~~~
                ../src/serialport.cpp: In function ‘void EIO_AfterGet(uv_work_t*)’:
                ../src/serialport.cpp:329:96: error: no matching function for call to ‘v8::Object::Set(v8::Local<v8::String>, Nan::imp::FactoryBase<v8::Boolean>::return_t)’
                    results->Set(Nan::New<v8::String>("cts").ToLocalChecked(), Nan::New<v8::Boolean>(data->cts));
                                                                                                               ^
                In file included from /home/iobroker/.cache/node-gyp/14.19.0/include/node/node.h:67,
                                from ../../../../nan/nan.h:54,
                                from ../src/./serialport.h:6,
                                from ../src/serialport.cpp:1:
                /home/iobroker/.cache/node-gyp/14.19.0/include/node/v8.h:3670:37: note: candidate: ‘v8::Maybe<bool> v8::Object::Set(v8::Local<v8::Context>, v8::Local<v8::Value>, v8::Local<v8::Value>)’
                  V8_WARN_UNUSED_RESULT Maybe<bool> Set(Local<Context> context,
                                                    ^~~
                /home/iobroker/.cache/node-gyp/14.19.0/include/node/v8.h:3670:37: note:   candidate expects 3 arguments, 2 provided
                /home/iobroker/.cache/node-gyp/14.19.0/include/node/v8.h:3673:37: note: candidate: ‘v8::Maybe<bool> v8::Object::Set(v8::Local<v8::Context>, uint32_t, v8::Local<v8::Value>)’
                  V8_WARN_UNUSED_RESULT Maybe<bool> Set(Local<Context> context, uint32_t index,
                                                    ^~~
                /home/iobroker/.cache/node-gyp/14.19.0/include/node/v8.h:3673:37: note:   candidate expects 3 arguments, 2 provided
                ../src/serialport.cpp:330:96: error: no matching function for call to ‘v8::Object::Set(v8::Local<v8::String>, Nan::imp::FactoryBase<v8::Boolean>::return_t)’
                    results->Set(Nan::New<v8::String>("dsr").ToLocalChecked(), Nan::New<v8::Boolean>(data->dsr));
                                                                                                               ^
                In file included from /home/iobroker/.cache/node-gyp/14.19.0/include/node/node.h:67,
                                from ../../../../nan/nan.h:54,
                                from ../src/./serialport.h:6,
                                from ../src/serialport.cpp:1:
                /home/iobroker/.cache/node-gyp/14.19.0/include/node/v8.h:3670:37: note: candidate: ‘v8::Maybe<bool> v8::Object::Set(v8::Local<v8::Context>, v8::Local<v8::Value>, v8::Local<v8::Value>)’
                  V8_WARN_UNUSED_RESULT Maybe<bool> Set(Local<Context> context,
                                                    ^~~
                /home/iobroker/.cache/node-gyp/14.19.0/include/node/v8.h:3670:37: note:   candidate expects 3 arguments, 2 provided
                /home/iobroker/.cache/node-gyp/14.19.0/include/node/v8.h:3673:37: note: candidate: ‘v8::Maybe<bool> v8::Object::Set(v8::Local<v8::Context>, uint32_t, v8::Local<v8::Value>)’
                  V8_WARN_UNUSED_RESULT Maybe<bool> Set(Local<Context> context, uint32_t index,
                                                    ^~~
                /home/iobroker/.cache/node-gyp/14.19.0/include/node/v8.h:3673:37: note:   candidate expects 3 arguments, 2 provided
                ../src/serialport.cpp:331:96: error: no matching function for call to ‘v8::Object::Set(v8::Local<v8::String>, Nan::imp::FactoryBase<v8::Boolean>::return_t)’
                    results->Set(Nan::New<v8::String>("dcd").ToLocalChecked(), Nan::New<v8::Boolean>(data->dcd));
                                                                                                               ^
                In file included from /home/iobroker/.cache/node-gyp/14.19.0/include/node/node.h:67,
                                from ../../../../nan/nan.h:54,
                                from ../src/./serialport.h:6,
                                from ../src/serialport.cpp:1:
                /home/iobroker/.cache/node-gyp/14.19.0/include/node/v8.h:3670:37: note: candidate: ‘v8::Maybe<bool> v8::Object::Set(v8::Local<v8::Context>, v8::Local<v8::Value>, v8::Local<v8::Value>)’
                  V8_WARN_UNUSED_RESULT Maybe<bool> Set(Local<Context> context,
                                                    ^~~
                /home/iobroker/.cache/node-gyp/14.19.0/include/node/v8.h:3670:37: note:   candidate expects 3 arguments, 2 provided
                /home/iobroker/.cache/node-gyp/14.19.0/include/node/v8.h:3673:37: note: candidate: ‘v8::Maybe<bool> v8::Object::Set(v8::Local<v8::Context>, uint32_t, v8::Local<v8::Value>)’
                  V8_WARN_UNUSED_RESULT Maybe<bool> Set(Local<Context> context, uint32_t index,
                                                    ^~~
                /home/iobroker/.cache/node-gyp/14.19.0/include/node/v8.h:3673:37: note:   candidate expects 3 arguments, 2 provided
                ../src/serialport.cpp:336:30: warning: ‘v8::Local<v8::Value> Nan::Callback::Call(int, v8::Local<v8::Value>*) const’ is deprecated [-Wdeprecated-declarations]
                  data->callback.Call(2, argv);
                                             ^
                In file included from ../src/./serialport.h:6,
                                from ../src/serialport.cpp:1:
                ../../../../nan/nan.h:1740:3: note: declared here
                  Call(int argc, v8::Local<v8::Value> argv[]) const {
                  ^~~~
                ../src/serialport.cpp: In function ‘Nan::NAN_METHOD_RETURN_TYPE GetBaudRate(Nan::NAN_METHOD_ARGS_TYPE)’:
                ../src/serialport.cpp:363:76: warning: cast between incompatible function types from ‘void (*)(uv_work_t*)’ {aka ‘void (*)(uv_work_s*)’} to ‘uv_after_work_cb’ {aka ‘void (*)(uv_work_s*, int)’} [-Wcast-function-type]
                  uv_queue_work(uv_default_loop(), req, EIO_GetBaudRate, (uv_after_work_cb)EIO_AfterGetBaudRate);
                                                                                           ^~~~~~~~~~~~~~~~~~~~
                ../src/serialport.cpp: In function ‘void EIO_AfterGetBaudRate(uv_work_t*)’:
                ../src/serialport.cpp:378:106: error: no matching function for call to ‘v8::Object::Set(v8::Local<v8::String>, Nan::imp::IntegerFactory<v8::Integer>::return_t)’
                    results->Set(Nan::New<v8::String>("baudRate").ToLocalChecked(), Nan::New<v8::Integer>(data->baudRate));
                                                                                                                         ^
                In file included from /home/iobroker/.cache/node-gyp/14.19.0/include/node/node.h:67,
                                from ../../../../nan/nan.h:54,
                                from ../src/./serialport.h:6,
                                from ../src/serialport.cpp:1:
                /home/iobroker/.cache/node-gyp/14.19.0/include/node/v8.h:3670:37: note: candidate: ‘v8::Maybe<bool> v8::Object::Set(v8::Local<v8::Context>, v8::Local<v8::Value>, v8::Local<v8::Value>)’
                  V8_WARN_UNUSED_RESULT Maybe<bool> Set(Local<Context> context,
                                                    ^~~
                /home/iobroker/.cache/node-gyp/14.19.0/include/node/v8.h:3670:37: note:   candidate expects 3 arguments, 2 provided
                /home/iobroker/.cache/node-gyp/14.19.0/include/node/v8.h:3673:37: note: candidate: ‘v8::Maybe<bool> v8::Object::Set(v8::Local<v8::Context>, uint32_t, v8::Local<v8::Value>)’
                  V8_WARN_UNUSED_RESULT Maybe<bool> Set(Local<Context> context, uint32_t index,
                                                    ^~~
                /home/iobroker/.cache/node-gyp/14.19.0/include/node/v8.h:3673:37: note:   candidate expects 3 arguments, 2 provided
                ../src/serialport.cpp:383:30: warning: ‘v8::Local<v8::Value> Nan::Callback::Call(int, v8::Local<v8::Value>*) const’ is deprecated [-Wdeprecated-declarations]
                  data->callback.Call(2, argv);
                                             ^
                In file included from ../src/./serialport.h:6,
                                from ../src/serialport.cpp:1:
                ../../../../nan/nan.h:1740:3: note: declared here
                  Call(int argc, v8::Local<v8::Value> argv[]) const {
                  ^~~~
                ../src/serialport.cpp: In function ‘Nan::NAN_METHOD_RETURN_TYPE Drain(Nan::NAN_METHOD_ARGS_TYPE)’:
                ../src/serialport.cpp:409:70: warning: cast between incompatible function types from ‘void (*)(uv_work_t*)’ {aka ‘void (*)(uv_work_s*)’} to ‘uv_after_work_cb’ {aka ‘void (*)(uv_work_s*, int)’} [-Wcast-function-type]
                  uv_queue_work(uv_default_loop(), req, EIO_Drain, (uv_after_work_cb)EIO_AfterDrain);
                                                                                     ^~~~~~~~~~~~~~
                ../src/serialport.cpp: In function ‘void EIO_AfterDrain(uv_work_t*)’:
                ../src/serialport.cpp:424:30: warning: ‘v8::Local<v8::Value> Nan::Callback::Call(int, v8::Local<v8::Value>*) const’ is deprecated [-Wdeprecated-declarations]
                  data->callback.Call(1, argv);
                                             ^
                In file included from ../src/./serialport.h:6,
                                from ../src/serialport.cpp:1:
                ../../../../nan/nan.h:1740:3: note: declared here
                  Call(int argc, v8::Local<v8::Value> argv[]) const {
                  ^~~~
                ../src/serialport.cpp: At global scope:
                ../src/serialport.cpp:430:28: warning: unnecessary parentheses in declaration of ‘ToParityEnum’ [-Wparentheses]
                SerialPortParity NAN_INLINE(ToParityEnum(const v8::Local<v8::String>& v8str)) {
                                           ^
                ../src/serialport.cpp:449:30: warning: unnecessary parentheses in declaration of ‘ToStopBitEnum’ [-Wparentheses]
                SerialPortStopBits NAN_INLINE(ToStopBitEnum(double stopBits)) {
                                             ^
                ../src/serialport.cpp:460:17: error: variable or field ‘init’ declared void
                  void init(v8::Handle<v8::Object> target) {
                                ^~~~~~
                ../src/serialport.cpp:460:17: error: ‘Handle’ is not a member of ‘v8’
                ../src/serialport.cpp:460:17: note: suggested alternative: ‘JobHandle’
                  void init(v8::Handle<v8::Object> target) {
                                ^~~~~~
                                JobHandle
                ../src/serialport.cpp:460:34: error: expected primary-expression before ‘>’ token
                  void init(v8::Handle<v8::Object> target) {
                                                 ^
                ../src/serialport.cpp:460:36: error: ‘target’ was not declared in this scope
                  void init(v8::Handle<v8::Object> target) {
                                                   ^~~~~~
                ../src/serialport.cpp:460:36: note: suggested alternative: ‘tzset’
                  void init(v8::Handle<v8::Object> target) {
                                                   ^~~~~~
                                                   tzset
                In file included from ../../../../nan/nan.h:54,
                                from ../src/./serialport.h:6,
                                from ../src/serialport.cpp:1:
                ../src/serialport.cpp:485:25: error: ‘init’ was not declared in this scope
                NODE_MODULE(serialport, init);
                                        ^~~~
                /home/iobroker/.cache/node-gyp/14.19.0/include/node/node.h:793:36: note: in definition of macro ‘NODE_MODULE_X’
                      (node::addon_register_func) (regfunc),                          \
                                                   ^~~~~~~
                ../src/serialport.cpp:485:1: note: in expansion of macro ‘NODE_MODULE’
                NODE_MODULE(serialport, init);
                ^~~~~~~~~~~
                ../src/serialport.cpp:485:25: note: suggested alternative: ‘int’
                NODE_MODULE(serialport, init);
                                        ^~~~
                /home/iobroker/.cache/node-gyp/14.19.0/include/node/node.h:793:36: note: in definition of macro ‘NODE_MODULE_X’
                      (node::addon_register_func) (regfunc),                          \
                                                   ^~~~~~~
                ../src/serialport.cpp:485:1: note: in expansion of macro ‘NODE_MODULE’
                NODE_MODULE(serialport, init);
                ^~~~~~~~~~~
                make: *** [serialport.target.mk:112: Release/obj.target/serialport/src/serialport.o] Fehler 1
                make: Verzeichnis „/opt/iobroker/node_modules/smartmeter-obis/node_modules/serialport/build“ wird verlassen
                gyp ERR! build error
                gyp ERR! stack Error: `make` failed with exit code: 2
                gyp ERR! stack     at ChildProcess.onExit (/usr/lib/node_modules/npm/node_modules/node-gyp/lib/build.js:194:23)
                gyp ERR! stack     at ChildProcess.emit (events.js:400:28)
                gyp ERR! stack     at Process.ChildProcess._handle.onexit (internal/child_process.js:282:12)
                gyp ERR! System Linux 5.10.63-v7+
                gyp ERR! command "/usr/bin/node" "/usr/lib/node_modules/npm/node_modules/node-gyp/bin/node-gyp.js" "rebuild"
                gyp ERR! cwd /opt/iobroker/node_modules/smartmeter-obis/node_modules/serialport
                gyp ERR! node -v v14.19.0
                gyp ERR! node-gyp -v v5.1.0
                gyp ERR! not ok
                
                > iobroker.js-controller@4.0.3 install /opt/iobroker/node_modules/iobroker.js-controller
                > node iobroker.js setup first
                
                object _design/system updated
                {
                 "defaultPrivate": "-----BEGIN RSA PRIVATE KEY-----\r\nMIIEogIBAAKxxxxxxTg7QV0OQyys=\r\n-----END RSA PRIVATE KEY-----\r\n",
                 "defaultPublic": "-----BEGIN CERTIFICATE-----\r\nMIIDhxxxxVq+7jnSy02opY\r\n-----END CERTIFICATE-----\r\n"
                }
                Update certificate defaultPrivate
                The object "system.certificates" was updated successfully.
                Update certificate defaultPublic
                The object "system.certificates" was updated successfully.
                npm WARN optional SKIPPING OPTIONAL DEPENDENCY: fsevents@~2.3.2 (node_modules/@iobroker/js-controller-cli/node_modules/chokidar/node_modules/fsevents):
                npm WARN notsup SKIPPING OPTIONAL DEPENDENCY: Unsupported platform for fsevents@2.3.2: wanted {"os":"darwin","arch":"any"} (current: {"os":"linux","arch":"arm"})
                npm WARN optional SKIPPING OPTIONAL DEPENDENCY: serialport@6.2.2 (node_modules/smartmeter-obis/node_modules/serialport):
                npm WARN optional SKIPPING OPTIONAL DEPENDENCY: serialport@6.2.2 install: `prebuild-install || node-gyp rebuild`
                npm WARN optional SKIPPING OPTIONAL DEPENDENCY: Exit status 1
                
                + iobroker.js-controller@4.0.3
                updated 14 packages in 237.614s
                
                60 packages are looking for funding
                 run `npm fund` for details
                
                pi@pi-iobroker:/opt/iobroker $
                
                

                HIer mal zwei Auszüge:

                npm WARN deprecated request@2.88.2: request has been deprecated, see https://github.com/request/request/issues/3142
                npm WARN deprecated har-validator@5.1.5: this library is no longer supported
                npm WARN deprecated uuid@3.4.0: Please upgrade  to version 7 or higher.  Older versions may use Math.random() in certain circumstances, which is known to be problematic.  See https://v8.dev/blog/math-random for details.
                
                

                und

                make: *** [serialport.target.mk:112: Release/obj.target/serialport/src/serialport.o] Fehler 1
                make: Verzeichnis „/opt/iobroker/node_modules/smartmeter-obis/node_modules/serialport/build“ wird verlassen
                gyp ERR! build error
                gyp ERR! stack Error: `make` failed with exit code: 2
                gyp ERR! stack     at ChildProcess.onExit (/usr/lib/node_modules/npm/node_modules/node-gyp/lib/build.js:194:23)
                gyp ERR! stack     at ChildProcess.emit (events.js:400:28)
                gyp ERR! stack     at Process.ChildProcess._handle.onexit (internal/child_process.js:282:12)
                gyp ERR! System Linux 5.10.63-v7+
                gyp ERR! command "/usr/bin/node" "/usr/lib/node_modules/npm/node_modules/node-gyp/bin/node-gyp.js" "rebuild"
                gyp ERR! cwd /opt/iobroker/node_modules/smartmeter-obis/node_modules/serialport
                gyp ERR! node -v v14.19.0
                gyp ERR! node-gyp -v v5.1.0
                gyp ERR! not ok
                

                Empfehlungen?

                Was/kann/muss ich machen damit das Forum hier nicht "Github" issues verlinkt ?

                apollon77A Offline
                apollon77A Offline
                apollon77
                schrieb am zuletzt editiert von
                #192

                @wendy2702 Im ersten schritt siehe oben: Alles ok, sind die üblichen Warnungen und Infos. Ignore

                Beitrag hat geholfen? Votet rechts unten im Beitrag :-) https://paypal.me/Apollon77 / https://github.com/sponsors/Apollon77

                • Debug-Log für Instanz einschalten? Admin -> Instanzen -> Expertenmodus -> Instanz aufklappen - Loglevel ändern
                • Logfiles auf Platte /opt/iobroker/log/… nutzen, Admin schneidet Zeilen ab
                1 Antwort Letzte Antwort
                0
                • apollon77A Offline
                  apollon77A Offline
                  apollon77
                  schrieb am zuletzt editiert von
                  #193

                  Hallo liebe Alpha-Tester,

                  ich (auch im Nahmen der anderen Beteiligten Core-Entwickler) bedanke mich vielmals für Eure Unterstützung beim Alpha Test bisher. Die 4.0.3 ist sehr gut (wir haben noch 2 Optimierungen in Edge Cases bei Multihost Environments, aber das blockiert einen Beta Release nicht wirklich) :-)

                  Falls wir doch nochmals größere Fixes haben würde ich ggf hier nochmal posten, aber generell sollte es jetzt unter https://forum.iobroker.net/topic/52208/js-controller-4-0-jetzt-im-beta-latest weitergehen.

                  Ingo

                  Beitrag hat geholfen? Votet rechts unten im Beitrag :-) https://paypal.me/Apollon77 / https://github.com/sponsors/Apollon77

                  • Debug-Log für Instanz einschalten? Admin -> Instanzen -> Expertenmodus -> Instanz aufklappen - Loglevel ändern
                  • Logfiles auf Platte /opt/iobroker/log/… nutzen, Admin schneidet Zeilen ab
                  1 Antwort Letzte Antwort
                  3
                  • opossumO opossum

                    Hallo, @apollon77,
                    ich habe das Log ja bei Bedarf, ist bis jetzt noch ok, läuft alles. Der DeConz-Adapter wirft noch ein paar Warnungen wegen falscher Feldtypen aus.

                    deconz.0 2022-02-01 23:39:04.828	warn	This object will not be created in future versions. Please report this to the developer.
                    deconz.0 2022-02-01 23:39:04.828	warn	Object Groups.2.xy is invalid: Default value has to be stringified but received type "object"
                    deconz.0 2022-02-01 23:39:04.820	warn	This object will not be created in future versions. Please report this to the developer.
                    deconz.0 2022-02-01 23:39:04.820	warn	Object Groups.65520.xy is invalid: Default value has to be stringified but received type "object"
                    deconz.0 2022-02-01 23:38:36.485	warn	This object will not be created in future versions. Please report this to the developer.
                    deconz.0 2022-02-01 23:38:36.485	warn	Object Groups.2.xy is invalid: Default value has to be stringified but received type "object"
                    deconz.0 2022-02-01 23:38:36.431	warn	This object will not be created in future versions. Please report this to the developer.
                    deconz.0 2022-02-01 23:38:36.430	warn	Object Groups.65520.xy is invalid: Default value has to be stringified but received type "object"
                    deconz.0 2022-02-01 23:30:32.366	warn	This object will not be created in future versions. Please report this to the developer.
                    deconz.0 2022-02-01 23:30:32.366	warn	Object Groups.2.xy is invalid: Default value has to be stringified but received type "object"
                    deconz.0 2022-02-01 23:30:32.359	warn	This object will not be created in future versions. Please report this to the developer.
                    deconz.0 2022-02-01 23:30:32.358	warn	Object Groups.65520.xy is invalid: Default value has to be stringified but received type "object"
                    

                    Geht das als Issue an den Entwickler vom DeConz-Adapter oder reicht es , das hier abzubilden?

                    Michael SchmittM Offline
                    Michael SchmittM Offline
                    Michael Schmitt
                    schrieb am zuletzt editiert von
                    #194

                    @opossum sagte in Alpha Test js-controller 4.0:

                    Hallo, @apollon77,
                    ich habe das Log ja bei Bedarf, ist bis jetzt noch ok, läuft alles. Der DeConz-Adapter wirft noch ein paar Warnungen wegen falscher Feldtypen aus.

                    deconz.0 2022-02-01 23:39:04.828	warn	This object will not be created in future versions. Please report this to the developer.
                    deconz.0 2022-02-01 23:39:04.828	warn	Object Groups.2.xy is invalid: Default value has to be stringified but received type "object"
                    deconz.0 2022-02-01 23:39:04.820	warn	This object will not be created in future versions. Please report this to the developer.
                    deconz.0 2022-02-01 23:39:04.820	warn	Object Groups.65520.xy is invalid: Default value has to be stringified but received type "object"
                    deconz.0 2022-02-01 23:38:36.485	warn	This object will not be created in future versions. Please report this to the developer.
                    deconz.0 2022-02-01 23:38:36.485	warn	Object Groups.2.xy is invalid: Default value has to be stringified but received type "object"
                    deconz.0 2022-02-01 23:38:36.431	warn	This object will not be created in future versions. Please report this to the developer.
                    deconz.0 2022-02-01 23:38:36.430	warn	Object Groups.65520.xy is invalid: Default value has to be stringified but received type "object"
                    deconz.0 2022-02-01 23:30:32.366	warn	This object will not be created in future versions. Please report this to the developer.
                    deconz.0 2022-02-01 23:30:32.366	warn	Object Groups.2.xy is invalid: Default value has to be stringified but received type "object"
                    deconz.0 2022-02-01 23:30:32.359	warn	This object will not be created in future versions. Please report this to the developer.
                    deconz.0 2022-02-01 23:30:32.358	warn	Object Groups.65520.xy is invalid: Default value has to be stringified but received type "object"
                    

                    Geht das als Issue an den Entwickler vom DeConz-Adapter oder reicht es , das hier abzubilden?

                    Hat sich hier schon was beim deconz Adapter getan. Ich habe die "warn" Meldungen nun beim update auf die stable Version ?

                    apollon77A 1 Antwort Letzte Antwort
                    0
                    • Michael SchmittM Michael Schmitt

                      @opossum sagte in Alpha Test js-controller 4.0:

                      Hallo, @apollon77,
                      ich habe das Log ja bei Bedarf, ist bis jetzt noch ok, läuft alles. Der DeConz-Adapter wirft noch ein paar Warnungen wegen falscher Feldtypen aus.

                      deconz.0 2022-02-01 23:39:04.828	warn	This object will not be created in future versions. Please report this to the developer.
                      deconz.0 2022-02-01 23:39:04.828	warn	Object Groups.2.xy is invalid: Default value has to be stringified but received type "object"
                      deconz.0 2022-02-01 23:39:04.820	warn	This object will not be created in future versions. Please report this to the developer.
                      deconz.0 2022-02-01 23:39:04.820	warn	Object Groups.65520.xy is invalid: Default value has to be stringified but received type "object"
                      deconz.0 2022-02-01 23:38:36.485	warn	This object will not be created in future versions. Please report this to the developer.
                      deconz.0 2022-02-01 23:38:36.485	warn	Object Groups.2.xy is invalid: Default value has to be stringified but received type "object"
                      deconz.0 2022-02-01 23:38:36.431	warn	This object will not be created in future versions. Please report this to the developer.
                      deconz.0 2022-02-01 23:38:36.430	warn	Object Groups.65520.xy is invalid: Default value has to be stringified but received type "object"
                      deconz.0 2022-02-01 23:30:32.366	warn	This object will not be created in future versions. Please report this to the developer.
                      deconz.0 2022-02-01 23:30:32.366	warn	Object Groups.2.xy is invalid: Default value has to be stringified but received type "object"
                      deconz.0 2022-02-01 23:30:32.359	warn	This object will not be created in future versions. Please report this to the developer.
                      deconz.0 2022-02-01 23:30:32.358	warn	Object Groups.65520.xy is invalid: Default value has to be stringified but received type "object"
                      

                      Geht das als Issue an den Entwickler vom DeConz-Adapter oder reicht es , das hier abzubilden?

                      Hat sich hier schon was beim deconz Adapter getan. Ich habe die "warn" Meldungen nun beim update auf die stable Version ?

                      apollon77A Offline
                      apollon77A Offline
                      apollon77
                      schrieb am zuletzt editiert von
                      #195

                      @michael-schmitt Wenn das GitHub issue noch da ist hat sich wohl leider noch nichts getan ...

                      Beitrag hat geholfen? Votet rechts unten im Beitrag :-) https://paypal.me/Apollon77 / https://github.com/sponsors/Apollon77

                      • Debug-Log für Instanz einschalten? Admin -> Instanzen -> Expertenmodus -> Instanz aufklappen - Loglevel ändern
                      • Logfiles auf Platte /opt/iobroker/log/… nutzen, Admin schneidet Zeilen ab
                      Michael SchmittM 1 Antwort Letzte Antwort
                      0
                      • apollon77A apollon77

                        @michael-schmitt Wenn das GitHub issue noch da ist hat sich wohl leider noch nichts getan ...

                        Michael SchmittM Offline
                        Michael SchmittM Offline
                        Michael Schmitt
                        schrieb am zuletzt editiert von
                        #196

                        @apollon77

                        hier das die Möglichkeit das ganze zu beheben, solange es noch kein update des deconz Adapters gibt.

                        HowTo @ github.com/foxriver76

                        funktioniert einwandfrei und keine Warnungen mehr.

                        1 Antwort Letzte Antwort
                        0
                        Antworten
                        • In einem neuen Thema antworten
                        Anmelden zum Antworten
                        • Älteste zuerst
                        • Neuste zuerst
                        • Meiste Stimmen


                        Support us

                        ioBroker
                        Community Adapters
                        Donate

                        402

                        Online

                        32.4k

                        Benutzer

                        81.5k

                        Themen

                        1.3m

                        Beiträge
                        Community
                        Impressum | Datenschutz-Bestimmungen | Nutzungsbedingungen | Einwilligungseinstellungen
                        ioBroker Community 2014-2025
                        logo
                        • Anmelden

                        • Du hast noch kein Konto? Registrieren

                        • Anmelden oder registrieren, um zu suchen
                        • Erster Beitrag
                          Letzter Beitrag
                        0
                        • Home
                        • Aktuell
                        • Tags
                        • Ungelesen 0
                        • Kategorien
                        • Unreplied
                        • Beliebt
                        • GitHub
                        • Docu
                        • Hilfe