Skip to content
  • Home
  • Aktuell
  • Tags
  • 0 Ungelesen 0
  • Kategorien
  • Unreplied
  • Beliebt
  • GitHub
  • Docu
  • Hilfe
Skins
  • Light
  • Brite
  • Cerulean
  • Cosmo
  • Flatly
  • Journal
  • Litera
  • Lumen
  • Lux
  • Materia
  • Minty
  • Morph
  • Pulse
  • Sandstone
  • Simplex
  • Sketchy
  • Spacelab
  • United
  • Yeti
  • Zephyr
  • Dark
  • Cyborg
  • Darkly
  • Quartz
  • Slate
  • Solar
  • Superhero
  • Vapor

  • Standard: (Kein Skin)
  • Kein Skin
Einklappen
ioBroker Logo

Community Forum

donate donate
  1. ioBroker Community Home
  2. Deutsch
  3. ioBroker Allgemein
  4. IRobot Roomba Adapter

NEWS

  • UPDATE 31.10.: Amazon Alexa - ioBroker Skill läuft aus ?
    apollon77A
    apollon77
    48
    3
    8.7k

  • Monatsrückblick – September 2025
    BluefoxB
    Bluefox
    13
    1
    2.2k

  • Neues Video "KI im Smart Home" - ioBroker plus n8n
    BluefoxB
    Bluefox
    16
    1
    3.0k

IRobot Roomba Adapter

Geplant Angeheftet Gesperrt Verschoben ioBroker Allgemein
851 Beiträge 101 Kommentatoren 312.5k Aufrufe 65 Watching
  • Älteste zuerst
  • Neuste zuerst
  • Meiste Stimmen
Antworten
  • In einem neuen Thema antworten
Anmelden zum Antworten
Dieses Thema wurde gelöscht. Nur Nutzer mit entsprechenden Rechten können es sehen.
  • JB_SullivanJ JB_Sullivan

    @Zefau sagte in IRobot Roomba Adapter:

    npm set python "C:\Users<User>.windows-build-tools\python27\python.exe"

    Nein, ich habe einen anderen Installationspfad - ob der richtig ist - don`t know.

    Ich habe es jetzt damit mal versucht und anschließend CANVAS nochmal installiert. Offensichtlich war es zum Teil wohl nicht ganz verkehrt, denn jetzt habe ich einen ganzen Sack voll neuer Meldungen bekommen. Leider waren auch da wieder ein paar Errors dabei.

    ..... achso - immer noch keine Karte. Ich denke für Heute lassen wir es gut sein ;) Ich muss morgen wieder raus - Danke erstmal


    C:>node-gyp --python "C:\Program Files\Python\python.exe"

    Usage: node-gyp <command> [options]

    where <command> is one of:
    - build - undefined
    - clean - Removes any generated build files and the "out" dir
    - configure - Generates MSVC project files for the current module
    - rebuild - Runs "clean", "configure" and "build" all at once
    - install - Install node development files for the specified node version.
    - list - undefined
    - remove - Removes the node development files for the specified version

    node-gyp@5.0.3 C:\Users\SmartHome\AppData\Roaming\npm\node_modules\node-gyp
    node@10.16.0

    C:>npm set python "C:\Program Files\Python\python.exe"

    C:>npm install canvas@2.6.0 --unsafe-perm=true

    canvas@2.6.0 install C:\node_modules\canvas
    node-pre-gyp install --fallback-to-build

    node-pre-gyp WARN Using needle for node-pre-gyp https download
    node-pre-gyp WARN Tried to download(404): https://github.com/node-gfx/node-canvas-prebuilt/releases/download/v2.6.0/canvas-v2.6.0-node-v64-win32-unknown-ia32.tar.gz
    node-pre-gyp WARN Pre-built binaries not found for canvas@2.6.0 and node@10.16.0 (node-v64 ABI, unknown) (falling back to source compile with node-gyp)
    Warning: Missing input files:
    C:\GTK\bin\libfreetype-6.dll
    C:\GTK\bin\libintl-8.dll
    Die Projekte in dieser Projektmappe werden nacheinander erstellt. Um eine parallele Erstellung zu ermöglichen, müssen Sie den Schalter "/m" hinzufügen.
    Copying C:/libjpeg-turbo/bin/jpeg62.dll to C:\node_modules\canvas\build\Release\jpeg62.dll
    1 Datei(en) kopiert.
    Backend.cc
    ImageBackend.cc
    PdfBackend.cc
    SvgBackend.cc
    BMPParser.cc
    Backends.cc
    c:\node_modules\canvas\src\bmp\bmpparser.cc(189): warning C4018: ">": Konflikt zwischen "signed" und "unsigned" [C:\nod
    e_modules\canvas\build\canvas.vcxproj]
    c:\node_modules\canvas\src\bmp\bmpparser.cc(204): warning C4018: ">": Konflikt zwischen "signed" und "unsigned" [C:\nod
    e_modules\canvas\build\canvas.vcxproj]
    Canvas.cc
    CanvasGradient.cc
    CanvasPattern.cc
    CanvasRenderingContext2d.cc
    closure.cc
    color.cc
    Image.cc
    ImageData.cc
    init.cc
    register_font.cc
    win_delay_load_hook.cc
    Bibliothek "C:\node_modules\canvas\build\Release\canvas.lib" und Objekt "C:\node_modules\canvas\build\Release\canv
    as.exp" werden erstellt.
    Code wird generiert.
    All 2104 functions were compiled because no usable IPDB/IOBJ from previous compilation was found.
    Codegenerierung ist abgeschlossen.
    canvas.vcxproj -> C:\node_modules\canvas\build\Release\canvas.node
    Copying C:/GTK/bin/libpangoft2-1.0-0.dll to C:\node_modules\canvas\build\Release\libpangoft2-1.0-0.dll
    1 Datei(en) kopiert.
    Copying C:/GTK/bin/libgthread-2.0-0.dll to C:\node_modules\canvas\build\Release\libgthread-2.0-0.dll
    1 Datei(en) kopiert.
    Copying C:/GTK/bin/libpangowin32-1.0-0.dll to C:\node_modules\canvas\build\Release\libpangowin32-1.0-0.dll
    1 Datei(en) kopiert.
    Copying C:/GTK/bin/libglib-2.0-0.dll to C:\node_modules\canvas\build\Release\libglib-2.0-0.dll
    1 Datei(en) kopiert.
    Copying C:/GTK/bin/libcairo-2.dll to C:\node_modules\canvas\build\Release\libcairo-2.dll
    1 Datei(en) kopiert.
    Copying C:/GTK/bin/libpango-1.0-0.dll to C:\node_modules\canvas\build\Release\libpango-1.0-0.dll
    1 Datei(en) kopiert.
    Copying C:/GTK/bin/libfontconfig-1.dll to C:\node_modules\canvas\build\Release\libfontconfig-1.dll
    1 Datei(en) kopiert.
    Copying C:/GTK/bin/libintl-8.dll to C:\node_modules\canvas\build\Release\libintl-8.dll
    Das System kann die angegebene Datei nicht finden.
    Copying C:/GTK/bin/libfreetype-6.dll to C:\node_modules\canvas\build\Release\libfreetype-6.dll
    Das System kann die angegebene Datei nicht finden.
    Copying C:/GTK/bin/libgmodule-2.0-0.dll to C:\node_modules\canvas\build\Release\libgmodule-2.0-0.dll
    1 Datei(en) kopiert.
    Copying C:/GTK/bin/libpangocairo-1.0-0.dll to C:\node_modules\canvas\build\Release\libpangocairo-1.0-0.dll
    1 Datei(en) kopiert.
    Copying C:/GTK/bin/libgobject-2.0-0.dll to C:\node_modules\canvas\build\Release\libgobject-2.0-0.dll
    1 Datei(en) kopiert.
    Copying C:/GTK/bin/libpng14-14.dll to C:\node_modules\canvas\build\Release\libpng14-14.dll
    1 Datei(en) kopiert.
    Copying C:/GTK/bin/zlib1.dll to C:\node_modules\canvas\build\Release\zlib1.dll
    1 Datei(en) kopiert.
    Copying C:/GTK/bin/libexpat-1.dll to C:\node_modules\canvas\build\Release\libexpat-1.dll
    1 Datei(en) kopiert.
    win_delay_load_hook.cc
    Code wird generiert.
    All 1 functions were compiled because no usable IPDB/IOBJ from previous compilation was found.
    Codegenerierung ist abgeschlossen.
    canvas-postbuild.vcxproj -> C:\node_modules\canvas\build\Release\canvas-postbuild.node
    npm WARN saveError ENOENT: no such file or directory, open 'C:\package.json'
    npm WARN enoent ENOENT: no such file or directory, open 'C:\package.json'
    npm WARN !invalid#1 No description
    npm WARN !invalid#1 No repository field.
    npm WARN !invalid#1 No README data
    npm WARN !invalid#1 No license field.

    • canvas@2.6.0
      added 72 packages from 36 contributors and audited 103 packages in 42.706s
      found 0 vulnerabilities

    C:>

    ZefauZ Offline
    ZefauZ Offline
    Zefau
    schrieb am zuletzt editiert von
    #285

    @JB_Sullivan Sieht erfolgreich aus. Adapter neustarten und gucken, ob er eine Karte erstellt, wenn der Roomba fährt :-)

    Meine Adapter: https://zefau.github.io/iobroker/

    1 Antwort Letzte Antwort
    0
    • JB_SullivanJ JB_Sullivan

      @Zefau sagte in IRobot Roomba Adapter:

      npm set python "C:\Users<User>.windows-build-tools\python27\python.exe"

      Nein, ich habe einen anderen Installationspfad - ob der richtig ist - don`t know.

      Ich habe es jetzt damit mal versucht und anschließend CANVAS nochmal installiert. Offensichtlich war es zum Teil wohl nicht ganz verkehrt, denn jetzt habe ich einen ganzen Sack voll neuer Meldungen bekommen. Leider waren auch da wieder ein paar Errors dabei.

      ..... achso - immer noch keine Karte. Ich denke für Heute lassen wir es gut sein ;) Ich muss morgen wieder raus - Danke erstmal


      C:>node-gyp --python "C:\Program Files\Python\python.exe"

      Usage: node-gyp <command> [options]

      where <command> is one of:
      - build - undefined
      - clean - Removes any generated build files and the "out" dir
      - configure - Generates MSVC project files for the current module
      - rebuild - Runs "clean", "configure" and "build" all at once
      - install - Install node development files for the specified node version.
      - list - undefined
      - remove - Removes the node development files for the specified version

      node-gyp@5.0.3 C:\Users\SmartHome\AppData\Roaming\npm\node_modules\node-gyp
      node@10.16.0

      C:>npm set python "C:\Program Files\Python\python.exe"

      C:>npm install canvas@2.6.0 --unsafe-perm=true

      canvas@2.6.0 install C:\node_modules\canvas
      node-pre-gyp install --fallback-to-build

      node-pre-gyp WARN Using needle for node-pre-gyp https download
      node-pre-gyp WARN Tried to download(404): https://github.com/node-gfx/node-canvas-prebuilt/releases/download/v2.6.0/canvas-v2.6.0-node-v64-win32-unknown-ia32.tar.gz
      node-pre-gyp WARN Pre-built binaries not found for canvas@2.6.0 and node@10.16.0 (node-v64 ABI, unknown) (falling back to source compile with node-gyp)
      Warning: Missing input files:
      C:\GTK\bin\libfreetype-6.dll
      C:\GTK\bin\libintl-8.dll
      Die Projekte in dieser Projektmappe werden nacheinander erstellt. Um eine parallele Erstellung zu ermöglichen, müssen Sie den Schalter "/m" hinzufügen.
      Copying C:/libjpeg-turbo/bin/jpeg62.dll to C:\node_modules\canvas\build\Release\jpeg62.dll
      1 Datei(en) kopiert.
      Backend.cc
      ImageBackend.cc
      PdfBackend.cc
      SvgBackend.cc
      BMPParser.cc
      Backends.cc
      c:\node_modules\canvas\src\bmp\bmpparser.cc(189): warning C4018: ">": Konflikt zwischen "signed" und "unsigned" [C:\nod
      e_modules\canvas\build\canvas.vcxproj]
      c:\node_modules\canvas\src\bmp\bmpparser.cc(204): warning C4018: ">": Konflikt zwischen "signed" und "unsigned" [C:\nod
      e_modules\canvas\build\canvas.vcxproj]
      Canvas.cc
      CanvasGradient.cc
      CanvasPattern.cc
      CanvasRenderingContext2d.cc
      closure.cc
      color.cc
      Image.cc
      ImageData.cc
      init.cc
      register_font.cc
      win_delay_load_hook.cc
      Bibliothek "C:\node_modules\canvas\build\Release\canvas.lib" und Objekt "C:\node_modules\canvas\build\Release\canv
      as.exp" werden erstellt.
      Code wird generiert.
      All 2104 functions were compiled because no usable IPDB/IOBJ from previous compilation was found.
      Codegenerierung ist abgeschlossen.
      canvas.vcxproj -> C:\node_modules\canvas\build\Release\canvas.node
      Copying C:/GTK/bin/libpangoft2-1.0-0.dll to C:\node_modules\canvas\build\Release\libpangoft2-1.0-0.dll
      1 Datei(en) kopiert.
      Copying C:/GTK/bin/libgthread-2.0-0.dll to C:\node_modules\canvas\build\Release\libgthread-2.0-0.dll
      1 Datei(en) kopiert.
      Copying C:/GTK/bin/libpangowin32-1.0-0.dll to C:\node_modules\canvas\build\Release\libpangowin32-1.0-0.dll
      1 Datei(en) kopiert.
      Copying C:/GTK/bin/libglib-2.0-0.dll to C:\node_modules\canvas\build\Release\libglib-2.0-0.dll
      1 Datei(en) kopiert.
      Copying C:/GTK/bin/libcairo-2.dll to C:\node_modules\canvas\build\Release\libcairo-2.dll
      1 Datei(en) kopiert.
      Copying C:/GTK/bin/libpango-1.0-0.dll to C:\node_modules\canvas\build\Release\libpango-1.0-0.dll
      1 Datei(en) kopiert.
      Copying C:/GTK/bin/libfontconfig-1.dll to C:\node_modules\canvas\build\Release\libfontconfig-1.dll
      1 Datei(en) kopiert.
      Copying C:/GTK/bin/libintl-8.dll to C:\node_modules\canvas\build\Release\libintl-8.dll
      Das System kann die angegebene Datei nicht finden.
      Copying C:/GTK/bin/libfreetype-6.dll to C:\node_modules\canvas\build\Release\libfreetype-6.dll
      Das System kann die angegebene Datei nicht finden.
      Copying C:/GTK/bin/libgmodule-2.0-0.dll to C:\node_modules\canvas\build\Release\libgmodule-2.0-0.dll
      1 Datei(en) kopiert.
      Copying C:/GTK/bin/libpangocairo-1.0-0.dll to C:\node_modules\canvas\build\Release\libpangocairo-1.0-0.dll
      1 Datei(en) kopiert.
      Copying C:/GTK/bin/libgobject-2.0-0.dll to C:\node_modules\canvas\build\Release\libgobject-2.0-0.dll
      1 Datei(en) kopiert.
      Copying C:/GTK/bin/libpng14-14.dll to C:\node_modules\canvas\build\Release\libpng14-14.dll
      1 Datei(en) kopiert.
      Copying C:/GTK/bin/zlib1.dll to C:\node_modules\canvas\build\Release\zlib1.dll
      1 Datei(en) kopiert.
      Copying C:/GTK/bin/libexpat-1.dll to C:\node_modules\canvas\build\Release\libexpat-1.dll
      1 Datei(en) kopiert.
      win_delay_load_hook.cc
      Code wird generiert.
      All 1 functions were compiled because no usable IPDB/IOBJ from previous compilation was found.
      Codegenerierung ist abgeschlossen.
      canvas-postbuild.vcxproj -> C:\node_modules\canvas\build\Release\canvas-postbuild.node
      npm WARN saveError ENOENT: no such file or directory, open 'C:\package.json'
      npm WARN enoent ENOENT: no such file or directory, open 'C:\package.json'
      npm WARN !invalid#1 No description
      npm WARN !invalid#1 No repository field.
      npm WARN !invalid#1 No README data
      npm WARN !invalid#1 No license field.

      • canvas@2.6.0
        added 72 packages from 36 contributors and audited 103 packages in 42.706s
        found 0 vulnerabilities

      C:>

      ZefauZ Offline
      ZefauZ Offline
      Zefau
      schrieb am zuletzt editiert von
      #286

      @JB_Sullivan Sehe gerade, dass du canvas nicht im iobroker.roomba Ordner installiert hast, oder? Wechsel nochmal in den iobroker.roomba Ordner und installiere canvas dort, dann sollte es klappen.

      Meine Adapter: https://zefau.github.io/iobroker/

      1 Antwort Letzte Antwort
      0
      • JB_SullivanJ Offline
        JB_SullivanJ Offline
        JB_Sullivan
        schrieb am zuletzt editiert von
        #287

        Also nochmal von Anfang an? .... und dann hier hin C:\ioBroker\iobroker-data\files\roomba ?

        Also quasi so - C:\ioBroker\iobroker-data\files\roomba>npm install canvas@2.6.0 --unsafe-perm=true

        ioBroker auf Intel Core i3-5005U NUC und Windwos10 Pro

        ZefauZ 1 Antwort Letzte Antwort
        0
        • JB_SullivanJ JB_Sullivan

          Also nochmal von Anfang an? .... und dann hier hin C:\ioBroker\iobroker-data\files\roomba ?

          Also quasi so - C:\ioBroker\iobroker-data\files\roomba>npm install canvas@2.6.0 --unsafe-perm=true

          ZefauZ Offline
          ZefauZ Offline
          Zefau
          schrieb am zuletzt editiert von
          #288

          @JB_Sullivan Ne C:\ioBroker\node_modules\iobroker.roomba

          Meine Adapter: https://zefau.github.io/iobroker/

          1 Antwort Letzte Antwort
          0
          • JB_SullivanJ Offline
            JB_SullivanJ Offline
            JB_Sullivan
            schrieb am zuletzt editiert von
            #289

            @Zefau sagte in IRobot Roomba Adapter:

            C:\ioBroker\node_modules\iobroker.roomba

            OK - next try

            C:\ioBroker\node_modules\iobroker.roomba>npm install canvas@2.6.0 --unsafe-perm=true

            canvas@2.6.0 install C:\ioBroker\node_modules\iobroker.roomba\node_modules\canvas
            node-pre-gyp install --fallback-to-build

            node-pre-gyp WARN Using request for node-pre-gyp https download
            node-pre-gyp WARN Tried to download(404): https://github.com/node-gfx/node-canvas-prebuilt/releases/download/v2.6.0/canvas-v2.6.0-node-v64-win32-unknown-ia32.tar.gz
            node-pre-gyp WARN Pre-built binaries not found for canvas@2.6.0 and node@10.16.0 (node-v64 ABI, unknown) (falling back to source compile with node-gyp)
            Warning: Missing input files:
            C:\GTK\bin\libfreetype-6.dll
            C:\GTK\bin\libintl-8.dll
            Die Projekte in dieser Projektmappe werden nacheinander erstellt. Um eine parallele Erstellung zu ermöglichen, müssen Sie den Schalter "/m" hinzufügen.
            Copying C:/libjpeg-turbo/bin/jpeg62.dll to C:\ioBroker\node_modules\iobroker.roomba\node_modules\canvas\build\Release
            \jpeg62.dll
            1 Datei(en) kopiert.
            Backend.cc
            ImageBackend.cc
            PdfBackend.cc
            SvgBackend.cc
            BMPParser.cc
            Backends.cc
            c:\iobroker\node_modules\iobroker.roomba\node_modules\canvas\src\bmp\bmpparser.cc(189): warning C4018: ">": Konflikt zw
            ischen "signed" und "unsigned" [C:\ioBroker\node_modules\iobroker.roomba\node_modules\canvas\build\canvas.vcxproj]
            c:\iobroker\node_modules\iobroker.roomba\node_modules\canvas\src\bmp\bmpparser.cc(204): warning C4018: ">": Konflikt zw
            ischen "signed" und "unsigned" [C:\ioBroker\node_modules\iobroker.roomba\node_modules\canvas\build\canvas.vcxproj]
            Canvas.cc
            CanvasGradient.cc
            CanvasPattern.cc
            CanvasRenderingContext2d.cc
            closure.cc
            color.cc
            Image.cc
            ImageData.cc
            init.cc
            register_font.cc
            win_delay_load_hook.cc
            Bibliothek "C:\ioBroker\node_modules\iobroker.roomba\node_modules\canvas\build\Release\canvas.lib" und Objekt "C:
            ioBroker\node_modules\iobroker.roomba\node_modules\canvas\build\Release\canvas.exp" werden erstellt.
            Code wird generiert.
            All 2104 functions were compiled because no usable IPDB/IOBJ from previous compilation was found.
            Codegenerierung ist abgeschlossen.
            canvas.vcxproj -> C:\ioBroker\node_modules\iobroker.roomba\node_modules\canvas\build\Release\canvas.node
            Copying C:/GTK/bin/libpangoft2-1.0-0.dll to C:\ioBroker\node_modules\iobroker.roomba\node_modules\canvas\build\Releas
            e\libpangoft2-1.0-0.dll
            1 Datei(en) kopiert.
            Copying C:/GTK/bin/libgthread-2.0-0.dll to C:\ioBroker\node_modules\iobroker.roomba\node_modules\canvas\build\Release
            \libgthread-2.0-0.dll
            1 Datei(en) kopiert.
            Copying C:/GTK/bin/libpangowin32-1.0-0.dll to C:\ioBroker\node_modules\iobroker.roomba\node_modules\canvas\build\Rele
            ase\libpangowin32-1.0-0.dll
            1 Datei(en) kopiert.
            Copying C:/GTK/bin/libglib-2.0-0.dll to C:\ioBroker\node_modules\iobroker.roomba\node_modules\canvas\build\Release\l
            ibglib-2.0-0.dll
            1 Datei(en) kopiert.
            Copying C:/GTK/bin/libcairo-2.dll to C:\ioBroker\node_modules\iobroker.roomba\node_modules\canvas\build\Release\libc
            airo-2.dll
            1 Datei(en) kopiert.
            Copying C:/GTK/bin/libpango-1.0-0.dll to C:\ioBroker\node_modules\iobroker.roomba\node_modules\canvas\build\Release\
            libpango-1.0-0.dll
            1 Datei(en) kopiert.
            Copying C:/GTK/bin/libfontconfig-1.dll to C:\ioBroker\node_modules\iobroker.roomba\node_modules\canvas\build\Release
            \libfontconfig-1.dll
            1 Datei(en) kopiert.
            Copying C:/GTK/bin/libintl-8.dll to C:\ioBroker\node_modules\iobroker.roomba\node_modules\canvas\build\Release\libin
            tl-8.dll
            Das System kann die angegebene Datei nicht finden.
            Copying C:/GTK/bin/libfreetype-6.dll to C:\ioBroker\node_modules\iobroker.roomba\node_modules\canvas\build\Release\l
            ibfreetype-6.dll
            Das System kann die angegebene Datei nicht finden.
            Copying C:/GTK/bin/libgmodule-2.0-0.dll to C:\ioBroker\node_modules\iobroker.roomba\node_modules\canvas\build\Release
            \libgmodule-2.0-0.dll
            1 Datei(en) kopiert.
            Copying C:/GTK/bin/libpangocairo-1.0-0.dll to C:\ioBroker\node_modules\iobroker.roomba\node_modules\canvas\build\Rele
            ase\libpangocairo-1.0-0.dll
            1 Datei(en) kopiert.
            Copying C:/GTK/bin/libgobject-2.0-0.dll to C:\ioBroker\node_modules\iobroker.roomba\node_modules\canvas\build\Release
            \libgobject-2.0-0.dll
            1 Datei(en) kopiert.
            Copying C:/GTK/bin/libpng14-14.dll to C:\ioBroker\node_modules\iobroker.roomba\node_modules\canvas\build\Release\lib
            png14-14.dll
            1 Datei(en) kopiert.
            Copying C:/GTK/bin/zlib1.dll to C:\ioBroker\node_modules\iobroker.roomba\node_modules\canvas\build\Release\zlib1.dll
            1 Datei(en) kopiert.
            Copying C:/GTK/bin/libexpat-1.dll to C:\ioBroker\node_modules\iobroker.roomba\node_modules\canvas\build\Release\libe
            xpat-1.dll
            1 Datei(en) kopiert.
            win_delay_load_hook.cc
            Code wird generiert.
            All 1 functions were compiled because no usable IPDB/IOBJ from previous compilation was found.
            Codegenerierung ist abgeschlossen.
            canvas-postbuild.vcxproj -> C:\ioBroker\node_modules\iobroker.roomba\node_modules\canvas\build\Release\canvas-postbu
            ild.node
            npm WARN optional SKIPPING OPTIONAL DEPENDENCY: fsevents@1.2.9 (node_modules\fsevents):
            npm WARN notsup SKIPPING OPTIONAL DEPENDENCY: Unsupported platform for fsevents@1.2.9: wanted {"os":"darwin","arch":"any"} (current: {"os":"win32","arch":"ia32"})

            • canvas@2.6.0
              added 377 packages from 1037 contributors, updated 1 package and audited 7531 packages in 46.328s
              found 0 vulnerabilities

            C:\ioBroker\node_modules\iobroker.roomba>

            ioBroker auf Intel Core i3-5005U NUC und Windwos10 Pro

            ZefauZ 1 Antwort Letzte Antwort
            0
            • JB_SullivanJ JB_Sullivan

              @Zefau sagte in IRobot Roomba Adapter:

              C:\ioBroker\node_modules\iobroker.roomba

              OK - next try

              C:\ioBroker\node_modules\iobroker.roomba>npm install canvas@2.6.0 --unsafe-perm=true

              canvas@2.6.0 install C:\ioBroker\node_modules\iobroker.roomba\node_modules\canvas
              node-pre-gyp install --fallback-to-build

              node-pre-gyp WARN Using request for node-pre-gyp https download
              node-pre-gyp WARN Tried to download(404): https://github.com/node-gfx/node-canvas-prebuilt/releases/download/v2.6.0/canvas-v2.6.0-node-v64-win32-unknown-ia32.tar.gz
              node-pre-gyp WARN Pre-built binaries not found for canvas@2.6.0 and node@10.16.0 (node-v64 ABI, unknown) (falling back to source compile with node-gyp)
              Warning: Missing input files:
              C:\GTK\bin\libfreetype-6.dll
              C:\GTK\bin\libintl-8.dll
              Die Projekte in dieser Projektmappe werden nacheinander erstellt. Um eine parallele Erstellung zu ermöglichen, müssen Sie den Schalter "/m" hinzufügen.
              Copying C:/libjpeg-turbo/bin/jpeg62.dll to C:\ioBroker\node_modules\iobroker.roomba\node_modules\canvas\build\Release
              \jpeg62.dll
              1 Datei(en) kopiert.
              Backend.cc
              ImageBackend.cc
              PdfBackend.cc
              SvgBackend.cc
              BMPParser.cc
              Backends.cc
              c:\iobroker\node_modules\iobroker.roomba\node_modules\canvas\src\bmp\bmpparser.cc(189): warning C4018: ">": Konflikt zw
              ischen "signed" und "unsigned" [C:\ioBroker\node_modules\iobroker.roomba\node_modules\canvas\build\canvas.vcxproj]
              c:\iobroker\node_modules\iobroker.roomba\node_modules\canvas\src\bmp\bmpparser.cc(204): warning C4018: ">": Konflikt zw
              ischen "signed" und "unsigned" [C:\ioBroker\node_modules\iobroker.roomba\node_modules\canvas\build\canvas.vcxproj]
              Canvas.cc
              CanvasGradient.cc
              CanvasPattern.cc
              CanvasRenderingContext2d.cc
              closure.cc
              color.cc
              Image.cc
              ImageData.cc
              init.cc
              register_font.cc
              win_delay_load_hook.cc
              Bibliothek "C:\ioBroker\node_modules\iobroker.roomba\node_modules\canvas\build\Release\canvas.lib" und Objekt "C:
              ioBroker\node_modules\iobroker.roomba\node_modules\canvas\build\Release\canvas.exp" werden erstellt.
              Code wird generiert.
              All 2104 functions were compiled because no usable IPDB/IOBJ from previous compilation was found.
              Codegenerierung ist abgeschlossen.
              canvas.vcxproj -> C:\ioBroker\node_modules\iobroker.roomba\node_modules\canvas\build\Release\canvas.node
              Copying C:/GTK/bin/libpangoft2-1.0-0.dll to C:\ioBroker\node_modules\iobroker.roomba\node_modules\canvas\build\Releas
              e\libpangoft2-1.0-0.dll
              1 Datei(en) kopiert.
              Copying C:/GTK/bin/libgthread-2.0-0.dll to C:\ioBroker\node_modules\iobroker.roomba\node_modules\canvas\build\Release
              \libgthread-2.0-0.dll
              1 Datei(en) kopiert.
              Copying C:/GTK/bin/libpangowin32-1.0-0.dll to C:\ioBroker\node_modules\iobroker.roomba\node_modules\canvas\build\Rele
              ase\libpangowin32-1.0-0.dll
              1 Datei(en) kopiert.
              Copying C:/GTK/bin/libglib-2.0-0.dll to C:\ioBroker\node_modules\iobroker.roomba\node_modules\canvas\build\Release\l
              ibglib-2.0-0.dll
              1 Datei(en) kopiert.
              Copying C:/GTK/bin/libcairo-2.dll to C:\ioBroker\node_modules\iobroker.roomba\node_modules\canvas\build\Release\libc
              airo-2.dll
              1 Datei(en) kopiert.
              Copying C:/GTK/bin/libpango-1.0-0.dll to C:\ioBroker\node_modules\iobroker.roomba\node_modules\canvas\build\Release\
              libpango-1.0-0.dll
              1 Datei(en) kopiert.
              Copying C:/GTK/bin/libfontconfig-1.dll to C:\ioBroker\node_modules\iobroker.roomba\node_modules\canvas\build\Release
              \libfontconfig-1.dll
              1 Datei(en) kopiert.
              Copying C:/GTK/bin/libintl-8.dll to C:\ioBroker\node_modules\iobroker.roomba\node_modules\canvas\build\Release\libin
              tl-8.dll
              Das System kann die angegebene Datei nicht finden.
              Copying C:/GTK/bin/libfreetype-6.dll to C:\ioBroker\node_modules\iobroker.roomba\node_modules\canvas\build\Release\l
              ibfreetype-6.dll
              Das System kann die angegebene Datei nicht finden.
              Copying C:/GTK/bin/libgmodule-2.0-0.dll to C:\ioBroker\node_modules\iobroker.roomba\node_modules\canvas\build\Release
              \libgmodule-2.0-0.dll
              1 Datei(en) kopiert.
              Copying C:/GTK/bin/libpangocairo-1.0-0.dll to C:\ioBroker\node_modules\iobroker.roomba\node_modules\canvas\build\Rele
              ase\libpangocairo-1.0-0.dll
              1 Datei(en) kopiert.
              Copying C:/GTK/bin/libgobject-2.0-0.dll to C:\ioBroker\node_modules\iobroker.roomba\node_modules\canvas\build\Release
              \libgobject-2.0-0.dll
              1 Datei(en) kopiert.
              Copying C:/GTK/bin/libpng14-14.dll to C:\ioBroker\node_modules\iobroker.roomba\node_modules\canvas\build\Release\lib
              png14-14.dll
              1 Datei(en) kopiert.
              Copying C:/GTK/bin/zlib1.dll to C:\ioBroker\node_modules\iobroker.roomba\node_modules\canvas\build\Release\zlib1.dll
              1 Datei(en) kopiert.
              Copying C:/GTK/bin/libexpat-1.dll to C:\ioBroker\node_modules\iobroker.roomba\node_modules\canvas\build\Release\libe
              xpat-1.dll
              1 Datei(en) kopiert.
              win_delay_load_hook.cc
              Code wird generiert.
              All 1 functions were compiled because no usable IPDB/IOBJ from previous compilation was found.
              Codegenerierung ist abgeschlossen.
              canvas-postbuild.vcxproj -> C:\ioBroker\node_modules\iobroker.roomba\node_modules\canvas\build\Release\canvas-postbu
              ild.node
              npm WARN optional SKIPPING OPTIONAL DEPENDENCY: fsevents@1.2.9 (node_modules\fsevents):
              npm WARN notsup SKIPPING OPTIONAL DEPENDENCY: Unsupported platform for fsevents@1.2.9: wanted {"os":"darwin","arch":"any"} (current: {"os":"win32","arch":"ia32"})

              • canvas@2.6.0
                added 377 packages from 1037 contributors, updated 1 package and audited 7531 packages in 46.328s
                found 0 vulnerabilities

              C:\ioBroker\node_modules\iobroker.roomba>

              ZefauZ Offline
              ZefauZ Offline
              Zefau
              schrieb am zuletzt editiert von
              #290

              @JB_Sullivan sagte in IRobot Roomba Adapter:

              added 377 packages from 1037 contributors, updated 1 package and audited 7531 packages in 46.328s

              Sieht super aus. Lass den Roomba laufen! :D

              Meine Adapter: https://zefau.github.io/iobroker/

              1 Antwort Letzte Antwort
              0
              • JB_SullivanJ Offline
                JB_SullivanJ Offline
                JB_Sullivan
                schrieb am zuletzt editiert von
                #291

                OK - muss ich morgen machen - das kann ich um die Uhrzeit hier keinem mehr antun. Teste ich morgen. Aber auf jeden Fall schonmal vielen Dank für deine Unterstützung.

                Rückmeldung gibt es dann morgen.

                ioBroker auf Intel Core i3-5005U NUC und Windwos10 Pro

                1 Antwort Letzte Antwort
                0
                • JB_SullivanJ Offline
                  JB_SullivanJ Offline
                  JB_Sullivan
                  schrieb am zuletzt editiert von JB_Sullivan
                  #292

                  Tja, Schade - hat leider nicht geklappt. Habe den Adapter nach der Aktion von gestern Abend gestoppt und neu gestartet und den Roboter einen vollen Zyklus laufen lassen - manuell gestartet.

                  In der Handy-App bekomme ich sowohl eine Reinigungskarte als auch eine WiFi Karte angezeigt.

                  Wenn ich aber hier bei deinem Adapter gucke, schreibt er mir beim Klick auf "Mission" -> Download Map = "No Map to Download"

                  2019-08-18 14_38_27-iRobot Roomba.png 2019-08-21 11.01.22.jpg 2019-08-21 11.01.15.jpg

                  Auch die Datenpunkte die vermutlich für die Kartdarstellung gefüllt sein müssten, sind leer.

                  2019-08-21 11_22_43-objects - ioBroker.png

                  ioBroker auf Intel Core i3-5005U NUC und Windwos10 Pro

                  ZefauZ 1 Antwort Letzte Antwort
                  0
                  • JB_SullivanJ JB_Sullivan

                    Tja, Schade - hat leider nicht geklappt. Habe den Adapter nach der Aktion von gestern Abend gestoppt und neu gestartet und den Roboter einen vollen Zyklus laufen lassen - manuell gestartet.

                    In der Handy-App bekomme ich sowohl eine Reinigungskarte als auch eine WiFi Karte angezeigt.

                    Wenn ich aber hier bei deinem Adapter gucke, schreibt er mir beim Klick auf "Mission" -> Download Map = "No Map to Download"

                    2019-08-18 14_38_27-iRobot Roomba.png 2019-08-21 11.01.22.jpg 2019-08-21 11.01.15.jpg

                    Auch die Datenpunkte die vermutlich für die Kartdarstellung gefüllt sein müssten, sind leer.

                    2019-08-21 11_22_43-objects - ioBroker.png

                    ZefauZ Offline
                    ZefauZ Offline
                    Zefau
                    schrieb am zuletzt editiert von
                    #293

                    @JB_Sullivan hmmm.. merkwürdig. Kannst du das Interface mal auf debug stellen und auch in der Adapter Konfiguration die Option Debug Mode for mission data aktivieren?
                    Die Option Refresh time (in sec.) preferences will be retrieved from robot bitte auf 20 Sekunden.

                    Wenn das alles eingestellt ist, bitte den Roomba für 5 Minuten laufen lassen (muss nicht lange sein) und mir das Log mal zuschicken (Achtung: Es wird eine Menge ausgegeben).

                    Meine Adapter: https://zefau.github.io/iobroker/

                    JB_SullivanJ 1 Antwort Letzte Antwort
                    0
                    • ZefauZ Zefau

                      @JB_Sullivan hmmm.. merkwürdig. Kannst du das Interface mal auf debug stellen und auch in der Adapter Konfiguration die Option Debug Mode for mission data aktivieren?
                      Die Option Refresh time (in sec.) preferences will be retrieved from robot bitte auf 20 Sekunden.

                      Wenn das alles eingestellt ist, bitte den Roomba für 5 Minuten laufen lassen (muss nicht lange sein) und mir das Log mal zuschicken (Achtung: Es wird eine Menge ausgegeben).

                      JB_SullivanJ Offline
                      JB_SullivanJ Offline
                      JB_Sullivan
                      schrieb am zuletzt editiert von
                      #294

                      @Zefau mache ich in einer Woche - sitze gerade
                      am Flughafen und warte auf den Flieger ;)

                      ioBroker auf Intel Core i3-5005U NUC und Windwos10 Pro

                      1 Antwort Letzte Antwort
                      0
                      • JB_SullivanJ Offline
                        JB_SullivanJ Offline
                        JB_Sullivan
                        schrieb am zuletzt editiert von
                        #295

                        So - I`m back in Town.

                        Hier schonmal eine erste Debug Ausgabe. Ich vermute mal der Pfad ist falsch oder? Da ist doch einmal node_modules zuviel oder? Wie bekomme ich das geheilt? Die Pfad Angabe muss doch bestimmt in irgend einer Config Datei drin stehen. Kann man die Händisch editieren? Das ganze node_modules Verzeichnis wurde nämlich noch ein zweites mal im iobroker.roomba Ordner angelegt. Ich vermute das ist nicht korrekt oder? Obwohl da die Datei canvas.node ebenfalls vorhanden ist.

                        2019-08-29 09_45_17-10.122.60.63 - Remotedesktopverbindung.png

                        roomba.0	2019-08-29 09:33:56.569	info	Connecting to Roomba (10.xxx.xxx.xxx)..
                        roomba.0	2019-08-29 09:33:56.569	debug	Das angegebene Modul wurde nicht gefunden. \\?\C:\ioBroker\node_modules\iobroker.roomba\node_modules\canvas\build\Release\canvas.node
                        roomba.0	2019-08-29 09:33:56.569	warn	Canvas not installed! Thus, no map drawings are possible.
                        roomba.0	2019-08-29 09:33:56.569	info	starting. Version 1.0.6 in C:/ioBroker/node_modules/iobroker.roomba, node: v10.16.0
                        

                        ioBroker auf Intel Core i3-5005U NUC und Windwos10 Pro

                        1 Antwort Letzte Antwort
                        0
                        • JB_SullivanJ Offline
                          JB_SullivanJ Offline
                          JB_Sullivan
                          schrieb am zuletzt editiert von JB_Sullivan
                          #296

                          So, jetzt geht gar nichts mehr - SCHEIß Google Autofill In. Beim speichern der neuen Mission Debug Einstellungen hat mir Auofill In irgend eine Grütze bei Benutzernamen und Passwort rein geschrieben.

                          Ein neuer Versuch den Roomba zu initialisieren scheitert mit der Meldung, das ich erst den Adapter starten soll - der ist aber gestartet. Ein Restart führt dazu, das der Adapter kurz auf grün geht und dann wieder rot wird.

                          Ich bekomme jetzt jedenfalls keine Verbindun mehr zum Roomba. Ich glaube ich lösche nochmal alles und fange gaaaanz von vorne an.

                          roomba.0	2019-08-29 10:22:20.553	info	Adapter stopped und unloaded.
                          roomba.0	2019-08-29 10:22:20.553	error	at TLSWrap.onStreamRead [as onread] (internal/stream_base_commons.js:94:17)
                          roomba.0	2019-08-29 10:22:20.553	error	at TLSSocket.Readable.push (_stream_readable.js:224:10)
                          roomba.0	2019-08-29 10:22:20.553	error	at readableAddChunk (_stream_readable.js:269:11)
                          roomba.0	2019-08-29 10:22:20.553	error	at addChunk (_stream_readable.js:288:12)
                          roomba.0	2019-08-29 10:22:20.553	error	at TLSSocket.emit (events.js:198:13)
                          roomba.0	2019-08-29 10:22:20.553	error	at TLSSocket.ondata (_stream_readable.js:693:20)
                          roomba.0	2019-08-29 10:22:20.553	error	at Writable.write (C:\ioBroker\node_modules\iobroker.roomba\node_modules\readable-stream\lib\_stream_writable.js:334:11)
                          roomba.0	2019-08-29 10:22:20.553	error	at writeOrBuffer (C:\ioBroker\node_modules\iobroker.roomba\node_modules\readable-stream\lib\_stream_writable.js:417:5)
                          roomba.0	2019-08-29 10:22:20.553	error	at doWrite (C:\ioBroker\node_modules\iobroker.roomba\node_modules\readable-stream\lib\_stream_writable.js:428:64)
                          roomba.0	2019-08-29 10:22:20.553	error	at Writable.writable._write (C:\ioBroker\node_modules\iobroker.roomba\node_modules\mqtt\lib\client.js:302:5)
                          roomba.0	2019-08-29 10:22:20.553	error	at work (C:\ioBroker\node_modules\iobroker.roomba\node_modules\mqtt\lib\client.js:292:12)
                          roomba.0	2019-08-29 10:22:20.553	error	at MqttClient._handlePacket (C:\ioBroker\node_modules\iobroker.roomba\node_modules\mqtt\lib\client.js:350:12)
                          roomba.0	2019-08-29 10:22:20.553	error	at MqttClient._handleConnack (C:\ioBroker\node_modules\iobroker.roomba\node_modules\mqtt\lib\client.js:920:15)
                          roomba.0	2019-08-29 10:22:20.553	error	Error: Connection refused: Not authorized
                          roomba.0	2019-08-29 10:22:20.553	error	uncaught exception: Connection refused: Not authorized
                          roomba.0	2019-08-29 10:22:18.725	info	Connecting to Roomba (10.122.60.10)..
                          

                          ioBroker auf Intel Core i3-5005U NUC und Windwos10 Pro

                          ZefauZ 1 Antwort Letzte Antwort
                          0
                          • JB_SullivanJ JB_Sullivan

                            So, jetzt geht gar nichts mehr - SCHEIß Google Autofill In. Beim speichern der neuen Mission Debug Einstellungen hat mir Auofill In irgend eine Grütze bei Benutzernamen und Passwort rein geschrieben.

                            Ein neuer Versuch den Roomba zu initialisieren scheitert mit der Meldung, das ich erst den Adapter starten soll - der ist aber gestartet. Ein Restart führt dazu, das der Adapter kurz auf grün geht und dann wieder rot wird.

                            Ich bekomme jetzt jedenfalls keine Verbindun mehr zum Roomba. Ich glaube ich lösche nochmal alles und fange gaaaanz von vorne an.

                            roomba.0	2019-08-29 10:22:20.553	info	Adapter stopped und unloaded.
                            roomba.0	2019-08-29 10:22:20.553	error	at TLSWrap.onStreamRead [as onread] (internal/stream_base_commons.js:94:17)
                            roomba.0	2019-08-29 10:22:20.553	error	at TLSSocket.Readable.push (_stream_readable.js:224:10)
                            roomba.0	2019-08-29 10:22:20.553	error	at readableAddChunk (_stream_readable.js:269:11)
                            roomba.0	2019-08-29 10:22:20.553	error	at addChunk (_stream_readable.js:288:12)
                            roomba.0	2019-08-29 10:22:20.553	error	at TLSSocket.emit (events.js:198:13)
                            roomba.0	2019-08-29 10:22:20.553	error	at TLSSocket.ondata (_stream_readable.js:693:20)
                            roomba.0	2019-08-29 10:22:20.553	error	at Writable.write (C:\ioBroker\node_modules\iobroker.roomba\node_modules\readable-stream\lib\_stream_writable.js:334:11)
                            roomba.0	2019-08-29 10:22:20.553	error	at writeOrBuffer (C:\ioBroker\node_modules\iobroker.roomba\node_modules\readable-stream\lib\_stream_writable.js:417:5)
                            roomba.0	2019-08-29 10:22:20.553	error	at doWrite (C:\ioBroker\node_modules\iobroker.roomba\node_modules\readable-stream\lib\_stream_writable.js:428:64)
                            roomba.0	2019-08-29 10:22:20.553	error	at Writable.writable._write (C:\ioBroker\node_modules\iobroker.roomba\node_modules\mqtt\lib\client.js:302:5)
                            roomba.0	2019-08-29 10:22:20.553	error	at work (C:\ioBroker\node_modules\iobroker.roomba\node_modules\mqtt\lib\client.js:292:12)
                            roomba.0	2019-08-29 10:22:20.553	error	at MqttClient._handlePacket (C:\ioBroker\node_modules\iobroker.roomba\node_modules\mqtt\lib\client.js:350:12)
                            roomba.0	2019-08-29 10:22:20.553	error	at MqttClient._handleConnack (C:\ioBroker\node_modules\iobroker.roomba\node_modules\mqtt\lib\client.js:920:15)
                            roomba.0	2019-08-29 10:22:20.553	error	Error: Connection refused: Not authorized
                            roomba.0	2019-08-29 10:22:20.553	error	uncaught exception: Connection refused: Not authorized
                            roomba.0	2019-08-29 10:22:18.725	info	Connecting to Roomba (10.122.60.10)..
                            
                            ZefauZ Offline
                            ZefauZ Offline
                            Zefau
                            schrieb am zuletzt editiert von Zefau
                            #297

                            @JB_Sullivan bevor du neu anfängst, zieh dir die Github Version. Der Fehler ist bekannt.

                            Und nutze nach dem Update unbedingt den Upload Button, damit das Backend aktualisiert wird.

                            EDIT: bzw. lösche das Passwort komplett raus, damit der Adapter nicht versucht zu verbinden.

                            Meine Adapter: https://zefau.github.io/iobroker/

                            1 Antwort Letzte Antwort
                            0
                            • JB_SullivanJ Offline
                              JB_SullivanJ Offline
                              JB_Sullivan
                              schrieb am zuletzt editiert von
                              #298

                              Sorry - keine Chance mehr. Selbst wenn ich die ganzen Daten (IP / Benutzername / PW) händisch eintrage bleibt der Adapter rot.
                              Auch der automatische Prozess über die Wlan Taste ergibt nur einen roten Adapter :( Ich habe alles so gemacht wie von dir beschrieben - löschen, aktualisieren usw.

                              ioBroker auf Intel Core i3-5005U NUC und Windwos10 Pro

                              1 Antwort Letzte Antwort
                              0
                              • JB_SullivanJ Offline
                                JB_SullivanJ Offline
                                JB_Sullivan
                                schrieb am zuletzt editiert von JB_Sullivan
                                #299

                                So ich habe jetzt den ganzen Nachmittag herum gemacht. Ich habe ALLE Versionen vorwärts und rückwärts up - und down gegradet - incl. Upload Button. Absolut keine Chance mehr eine Verbindung mit dem Roomba aufzubauen.

                                Ich dachte es liegt evtl. an der Authentifizierungs Methode aber egal was ich auch versuche ich kriege keine Verbindung. Ich habe in der Roomba APP extra nochmal ein neues Passwort vergeben.

                                Trotzdem tut die Anmeldemaske so, als ob er keine Verbindung zum Adapter aufbauen kann.

                                Kleine Anmerkung am Rande - du hast unter "Einstellungen" bei Passwort - " Passwort zeigen / vergeben" stehen. Das soll bestimmt VERBERGEN heißen.

                                Verbinde zum Adapter..
                                Verbunden zum Adapter. Lade Zugangsdaten..
                                Lade Zugangsdaten..
                                Zugangsdaten konnten nicht geladen werden! Folge der Anleitung und versuche es nochmal. ([object Object])
                                Lade IP Adresse..
                                IP Adresse konnte nicht geladen werden! (bind EADDRINUSE 0.0.0.0:5678)
                                


                                $ ./iobroker add roomba --host iobroker
                                NPM version: 6.9.0
                                npm install iobroker.roomba@1.0.6 --production --save --prefix "C:/ioBroker" (System call)
                                node-pre-gyp

                                WARN

                                Using request for node-pre-gyp https download

                                node-pre-gyp WARN Tried to download(404): https://github.com/node-gfx/node-canvas-prebuilt/releases/download/v2.6.0/canvas-v2.6.0-node-v64-win32-unknown-ia32.tar.gz node-pre-gyp WARN Pre-built binaries not found for canvas@2.6.0 and node@10.16.0 (node-v64 ABI, unknown) (falling back to source compile with node-gyp)

                                gyp

                                ERR!
                                build error

                                gyp

                                ERR!

                                stack
                                Error: C:\Program Files\Microsoft Visual Studio\2017\BuildTools\MSBuild\15.0\Bin\MSBuild.exe failed with exit code: 1
                                gyp

                                ERR!

                                stack
                                at ChildProcess.onExit (C:\Program Files\nodejs\node_modules\npm\node_modules\node-gyp\lib\build.js:262:23)
                                gyp

                                ERR!

                                stack
                                at ChildProcess.emit (events.js:198:13)
                                gyp

                                ERR!

                                stack
                                at Process.ChildProcess._handle.onexit (internal/child_process.js:248:12)
                                gyp

                                ERR! System Windows_NT 10.0.17763gyp ERR! command "C:\Program Files\nodejs\node.exe" "C:\Program Files\nodejs\node_modules\npm\node_modules\node-gyp\bin\node-gyp.js" "build" "--fallback-to-build" "--module=C:\ioBroker\node_modules\iobroker.roomba\node_modules\canvas\build\Release\canvas.node" "--module_name=canvas" "--module_path=C:\ioBroker\node_modules\iobroker.roomba\node_modules\canvas\build\Release" "--napi_version=4" "--node_abi_napi=napi" "--napi_build_version=0" "--node_napi_label=node-v64"
                                gyp ERR! cwd C:\ioBroker\node_modules\iobroker.roomba\node_modules\canvas
                                gyp ERR! node -v v10.16.0
                                gyp ERR! node-gyp -v v3.8.0
                                gyp ERR! not ok

                                node-pre-gyp
                                ERR! build error node-pre-gyp
                                ERR!
                                stack
                                Error: Failed to execute 'C:\Program Files\nodejs\node.exe C:\Program Files\nodejs\node_modules\npm\node_modules\node-gyp\bin\node-gyp.js build --fallback-to-build --module=C:\ioBroker\node_modules\iobroker.roomba\node_modules\canvas\build\Release\canvas.node --module_name=canvas --module_path=C:\ioBroker\node_modules\iobroker.roomba\node_modules\canvas\build\Release --napi_version=4 --node_abi_napi=napi --napi_build_version=0 --node_napi_label=node-v64' (1)
                                node-pre-gyp
                                ERR!

                                stack at ChildProcess.<anonymous> (C:\ioBroker\node_modules\iobroker.roomba\node_modules\node-pre-gyp\lib\util\compile.js:83:29)
                                node-pre-gyp
                                ERR!

                                stack
                                at ChildProcess.emit (events.js:198:13)
                                node-pre-gyp ERR!
                                stack
                                at maybeClose (internal/child_process.js:982:16)
                                node-pre-gyp

                                ERR!

                                stack
                                at Process.ChildProcess._handle.onexit (internal/child_process.js:259:5)
                                node-pre-gyp
                                ERR! System Windows_NT 10.0.17763
                                node-pre-gyp

                                ERR!

                                command
                                "C:\Program Files\nodejs\node.exe" "C:\ioBroker\node_modules\iobroker.roomba\node_modules\node-pre-gyp\bin\node-pre-gyp" "install" "--fallback-to-build"
                                node-pre-gyp

                                ERR!

                                cwd
                                C:\ioBroker\node_modules\iobroker.roomba\node_modules\canvas
                                node-pre-gyp

                                ERR!

                                node -v
                                v10.16.0
                                node-pre-gyp ERR! node-pre-gyp -v v0.11.0node-pre-gyp ERR! not ok

                                npm

                                ERR!

                                code
                                ELIFECYCLE
                                npm
                                ERR! errno 1
                                npm
                                ERR!
                                canvas@2.6.0 install: node-pre-gyp install --fallback-to-build
                                npm

                                ERR!
                                Exit status 1
                                npm

                                ERR!

                                npm

                                ERR!
                                Failed at the canvas@2.6.0 install script.
                                npm

                                ERR!
                                This is probably not a problem with npm. There is likely additional logging output above.

                                npm ERR! A complete log of this run can be found in:npm ERR! C:\WINDOWS\system32\config\systemprofile\AppData\Roaming\npm-cache_logs\2019-08-29T20_13_45_429Z-debug.log

                                host.iobroker install adapter roomba
                                NPM version: 6.9.0
                                npm install iobroker.roomba@1.0.6 --production --save --prefix "C:/ioBroker" (System call)
                                node-pre-gyp

                                WARN

                                Using request for node-pre-gyp https download

                                node-pre-gyp WARN Tried to download(404): https://github.com/node-gfx/node-canvas-prebuilt/releases/download/v2.6.0/canvas-v2.6.0-node-v64-win32-unknown-ia32.tar.gz node-pre-gyp WARN Pre-built binaries not found for canvas@2.6.0 and node@10.16.0 (node-v64 ABI, unknown) (falling back to source compile with node-gyp)

                                gyp

                                ERR! build error

                                gyp

                                ERR!

                                stack
                                Error: C:\Program Files\Microsoft Visual Studio\2017\BuildTools\MSBuild\15.0\Bin\MSBuild.exe failed with exit code: 1
                                gyp

                                ERR!

                                stack
                                at ChildProcess.onExit (C:\Program Files\nodejs\node_modules\npm\node_modules\node-gyp\lib\build.js:262:23)
                                gyp

                                ERR!

                                stack
                                at ChildProcess.emit (events.js:198:13)
                                gyp

                                ERR!

                                stack
                                at Process.ChildProcess._handle.onexit (internal/child_process.js:248:12)
                                gyp
                                ERR!
                                System
                                Windows_NT 10.0.17763
                                gyp
                                ERR!

                                command
                                "C:\Program Files\nodejs\node.exe" "C:\Program Files\nodejs\node_modules\npm\node_modules\node-gyp\bin\node-gyp.js" "build" "--fallback-to-build" "--module=C:\ioBroker\node_modules\iobroker.roomba\node_modules\canvas\build\Release\canvas.node" "--module_name=canvas" "--module_path=C:\ioBroker\node_modules\iobroker.roomba\node_modules\canvas\build\Release" "--napi_version=4" "--node_abi_napi=napi" "--napi_build_version=0" "--node_napi_label=node-v64"
                                gyp

                                ERR!

                                cwd
                                C:\ioBroker\node_modules\iobroker.roomba\node_modules\canvas
                                gyp

                                ERR!

                                node -v
                                v10.16.0
                                gyp

                                ERR!

                                node-gyp -v
                                v3.8.0
                                gyp

                                ERR!

                                not ok

                                node-pre-gyp
                                ERR! build error
                                node-pre-gyp

                                ERR!

                                stack
                                Error: Failed to execute 'C:\Program Files\nodejs\node.exe C:\Program Files\nodejs\node_modules\npm\node_modules\node-gyp\bin\node-gyp.js build --fallback-to-build --module=C:\ioBroker\node_modules\iobroker.roomba\node_modules\canvas\build\Release\canvas.node --module_name=canvas --module_path=C:\ioBroker\node_modules\iobroker.roomba\node_modules\canvas\build\Release --napi_version=4 --node_abi_napi=napi --napi_build_version=0 --node_napi_label=node-v64' (1)
                                node-pre-gyp

                                ERR!

                                stack
                                at ChildProcess.<anonymous> (C:\ioBroker\node_modules\iobroker.roomba\node_modules\node-pre-gyp\lib\util\compile.js:83:29)
                                node-pre-gyp

                                ERR!

                                stack
                                at ChildProcess.emit (events.js:198:13)
                                node-pre-gyp

                                ERR!

                                stack
                                at maybeClose (internal/child_process.js:982:16)
                                node-pre-gyp

                                ERR!

                                stack
                                at Process.ChildProcess._handle.onexit (internal/child_process.js:259:5)
                                node-pre-gyp

                                ERR!

                                System
                                Windows_NT 10.0.17763
                                node-pre-gyp

                                ERR!

                                command
                                "C:\Program Files\nodejs\node.exe" "C:\ioBroker\node_modules\iobroker.roomba\node_modules\node-pre-gyp\bin\node-pre-gyp" "install" "--fallback-to-build"
                                node-pre-gyp

                                ERR!

                                cwd
                                C:\ioBroker\node_modules\iobroker.roomba\node_modules\canvas
                                node-pre-gyp

                                ERR!

                                node -v
                                v10.16.0
                                node-pre-gyp

                                ERR!

                                node-pre-gyp -v
                                v0.11.0
                                node-pre-gyp

                                ERR!

                                not ok

                                npm

                                ERR!

                                code
                                ELIFECYCLE
                                npm

                                ERR!

                                errno
                                1
                                npm

                                ERR!
                                canvas@2.6.0 install: node-pre-gyp install --fallback-to-build
                                npm

                                ERR!
                                Exit status 1
                                npm

                                ERR!

                                npm

                                ERR!
                                Failed at the canvas@2.6.0 install script.
                                npm

                                ERR!
                                This is probably not a problem with npm. There is likely additional logging output above.

                                npm

                                ERR!
                                A complete log of this run can be found in:npm
                                ERR! C:\WINDOWS\system32\config\systemprofile\AppData\Roaming\npm-cache_logs\2019-08-29T20_14_12_928Z-debug.log
                                host.iobroker install adapter roomba
                                NPM version: 6.9.0
                                npm install iobroker.roomba@1.0.6 --production --save --prefix "C:/ioBroker" (System call)
                                node-pre-gyp

                                WARN
                                Using request for node-pre-gyp https download

                                node-pre-gyp WARN Tried to download(404): https://github.com/node-gfx/node-canvas-prebuilt/releases/download/v2.6.0/canvas-v2.6.0-node-v64-win32-unknown-ia32.tar.gz node-pre-gyp WARN Pre-built binaries not found for canvas@2.6.0 and node@10.16.0 (node-v64 ABI, unknown) (falling back to source compile with node-gyp)

                                gyp

                                ERR!
                                build error

                                gyp
                                ERR!
                                stack
                                Error: C:\Program Files\Microsoft Visual Studio\2017\BuildTools\MSBuild\15.0\Bin\MSBuild.exe failed with exit code: 1
                                gyp ERR!

                                stack
                                at ChildProcess.onExit (C:\Program Files\nodejs\node_modules\npm\node_modules\node-gyp\lib\build.js:262:23)gyp

                                ERR!

                                stack
                                at ChildProcess.emit (events.js:198:13)
                                gyp

                                ERR!

                                stack at Process.ChildProcess._handle.onexit (internal/child_process.js:248:12)
                                gyp
                                ERR!
                                System
                                Windows_NT 10.0.17763
                                gyp

                                ERR!

                                command
                                "C:\Program Files\nodejs\node.exe" "C:\Program Files\nodejs\node_modules\npm\node_modules\node-gyp\bin\node-gyp.js" "build" "--fallback-to-build" "--module=C:\ioBroker\node_modules\iobroker.roomba\node_modules\canvas\build\Release\canvas.node" "--module_name=canvas" "--module_path=C:\ioBroker\node_modules\iobroker.roomba\node_modules\canvas\build\Release" "--napi_version=4" "--node_abi_napi=napi" "--napi_build_version=0" "--node_napi_label=node-v64"
                                gyp

                                ERR!

                                cwd
                                C:\ioBroker\node_modules\iobroker.roomba\node_modules\canvas
                                gyp

                                ERR!

                                node -v
                                v10.16.0
                                gyp

                                ERR!

                                node-gyp -v
                                v3.8.0
                                gyp

                                ERR!

                                not ok

                                node-pre-gyp
                                ERR! build error
                                node-pre-gyp

                                ERR!

                                stack
                                Error: Failed to execute 'C:\Program Files\nodejs\node.exe C:\Program Files\nodejs\node_modules\npm\node_modules\node-gyp\bin\node-gyp.js build --fallback-to-build --module=C:\ioBroker\node_modules\iobroker.roomba\node_modules\canvas\build\Release\canvas.node --module_name=canvas --module_path=C:\ioBroker\node_modules\iobroker.roomba\node_modules\canvas\build\Release --napi_version=4 --node_abi_napi=napi --napi_build_version=0 --node_napi_label=node-v64' (1)
                                node-pre-gyp

                                ERR!

                                stack
                                at ChildProcess.<anonymous> (C:\ioBroker\node_modules\iobroker.roomba\node_modules\node-pre-gyp\lib\util\compile.js:83:29)
                                node-pre-gyp

                                ERR!

                                stack
                                at ChildProcess.emit (events.js:198:13)
                                node-pre-gyp
                                ERR! stack at maybeClose (internal/child_process.js:982:16)node-pre-gyp ERR! stack
                                at Process.ChildProcess._handle.onexit (internal/child_process.js:259:5)
                                node-pre-gyp

                                ERR!

                                System
                                Windows_NT 10.0.17763
                                node-pre-gyp

                                ERR!

                                command
                                "C:\Program Files\nodejs\node.exe" "C:\ioBroker\node_modules\iobroker.roomba\node_modules\node-pre-gyp\bin\node-pre-gyp" "install" "--fallback-to-build"
                                node-pre-gyp

                                ERR!

                                cwd
                                C:\ioBroker\node_modules\iobroker.roomba\node_modules\canvas
                                node-pre-gyp

                                ERR!

                                node -v
                                v10.16.0
                                node-pre-gyp

                                ERR!

                                node-pre-gyp -v
                                v0.11.0
                                node-pre-gyp

                                ERR!

                                not ok

                                npm
                                ERR!
                                code ELIFECYCLE
                                npm
                                ERR! errno
                                1
                                npm
                                ERR!
                                canvas@2.6.0 install: node-pre-gyp install --fallback-to-build
                                npm
                                ERR!
                                Exit status 1
                                npm

                                ERR!

                                npm

                                ERR!
                                Failed at the canvas@2.6.0 install script.
                                npm

                                ERR!
                                This is probably not a problem with npm. There is likely additional logging output above.

                                npm ERR! A complete log of this run can be found in:npm ERR! C:\WINDOWS\system32\config\systemprofile\AppData\Roaming\npm-cache_logs\2019-08-29T20_14_41_520Z-debug.log

                                host.iobroker install adapter roomba
                                ERROR: host.iobroker Cannot install roomba
                                ERROR: process exited with code 13

                                ioBroker auf Intel Core i3-5005U NUC und Windwos10 Pro

                                1 Antwort Letzte Antwort
                                0
                                • JB_SullivanJ Offline
                                  JB_SullivanJ Offline
                                  JB_Sullivan
                                  schrieb am zuletzt editiert von
                                  #300

                                  So der Spaß geht weiter - nachdem ich nun den Schritt gegangen bin und ein altes Backup eingespielt habe (vom19.08.2019) bin ich überhaupt nicht mehr in der Lage den roomba Adapter upzudaten oder ihn zu installieren.

                                  Es kommen Fehlermeldungen on Mass:

                                  Beim Versuch den Adpter über Admin auf 1.0.6 hoch zu ziehen:


                                  $ ./iobroker upgrade roomba
                                  Update roomba from @1.0.4 to @1.0.6
                                  NPM version: 6.9.0
                                  npm install iobroker.roomba@1.0.6 --production --save --prefix "C:/ioBroker" (System call)
                                  npm
                                  WARN rollback Rolling back iobroker.roomba@1.0.6 failed (this is probably harmless): EBUSY: resource busy or locked, rmdir 'C:\ioBroker\node_modules\iobroker.roomba'
                                  npm
                                  ERR! path C:\ioBroker\node_modules\iobroker.roombanpm
                                  ERR! code
                                  EBUSY
                                  npm

                                  ERR!

                                  errno
                                  -4082
                                  npm

                                  ERR!

                                  syscall
                                  rename
                                  npm ERR!
                                  EBUSY: resource busy or locked, rename 'C:\ioBroker\node_modules\iobroker.roomba' -> 'C:\ioBroker\node_modules.iobroker.roomba.DELETE'

                                  npm ERR! A complete log of this run can be found in:npm ERR! C:\WINDOWS\system32\config\systemprofile\AppData\Roaming\npm-cache_logs\2019-08-30T05_25_49_712Z-debug.log

                                  ERROR: host.iobroker Cannot install iobroker.roomba@1.0.6: 4294963214
                                  ERROR: process exited with code 25

                                  Und hier ein paar Meldungen wenn man versucht den Canvas Adapter gemäß GitHub Beschreibung zu installieren.


                                  C:\ioBroker\node_modules\iobroker.roomba>npm install canvas

                                  canvas@2.6.0 install C:\ioBroker\node_modules\iobroker.roomba\node_modules\canvas
                                  node-pre-gyp install --fallback-to-build

                                  node-pre-gyp WARN Using request for node-pre-gyp https download
                                  node-pre-gyp WARN Tried to download(404): https://github.com/node-gfx/node-canvas-prebuilt/releases/download/v2.6.0/canvas-v2.6.0-node-v64-win32-unknown-ia32.tar.gz
                                  node-pre-gyp WARN Pre-built binaries not found for canvas@2.6.0 and node@10.16.0 (node-v64 ABI, unknown) (falling back to source compile with node-gyp)
                                  Warning: Missing input files:
                                  C:\GTK\bin\libfreetype-6.dll
                                  C:\GTK\bin\libintl-8.dll
                                  Die Projekte in dieser Projektmappe werden nacheinander erstellt. Um eine parallele Erstellung zu ermöglichen, müssen Sie den Schalter "/m" hinzufügen.
                                  Copying C:/libjpeg-turbo/bin/jpeg62.dll to C:\ioBroker\node_modules\iobroker.roomba\node_modules\canvas\build\Release
                                  \jpeg62.dll
                                  1 Datei(en) kopiert.
                                  Backend.cc
                                  ImageBackend.cc
                                  PdfBackend.cc
                                  SvgBackend.cc
                                  BMPParser.cc
                                  Backends.cc
                                  c:\iobroker\node_modules\iobroker.roomba\node_modules\canvas\src\bmp\bmpparser.cc(189): warning C4018: ">": Konflikt zw
                                  ischen "signed" und "unsigned" [C:\ioBroker\node_modules\iobroker.roomba\node_modules\canvas\build\canvas.vcxproj]
                                  c:\iobroker\node_modules\iobroker.roomba\node_modules\canvas\src\bmp\bmpparser.cc(204): warning C4018: ">": Konflikt zw
                                  ischen "signed" und "unsigned" [C:\ioBroker\node_modules\iobroker.roomba\node_modules\canvas\build\canvas.vcxproj]
                                  Canvas.cc
                                  CanvasGradient.cc
                                  CanvasPattern.cc
                                  CanvasRenderingContext2d.cc
                                  closure.cc
                                  color.cc
                                  Image.cc
                                  ImageData.cc
                                  init.cc
                                  register_font.cc
                                  win_delay_load_hook.cc
                                  Bibliothek "C:\ioBroker\node_modules\iobroker.roomba\node_modules\canvas\build\Release\canvas.lib" und Objekt "C:
                                  ioBroker\node_modules\iobroker.roomba\node_modules\canvas\build\Release\canvas.exp" werden erstellt.
                                  Code wird generiert.
                                  All 2104 functions were compiled because no usable IPDB/IOBJ from previous compilation was found.
                                  Codegenerierung ist abgeschlossen.
                                  canvas.vcxproj -> C:\ioBroker\node_modules\iobroker.roomba\node_modules\canvas\build\Release\canvas.node
                                  Copying C:/GTK/bin/libpangoft2-1.0-0.dll to C:\ioBroker\node_modules\iobroker.roomba\node_modules\canvas\build\Releas
                                  e\libpangoft2-1.0-0.dll
                                  1 Datei(en) kopiert.
                                  Copying C:/GTK/bin/libgthread-2.0-0.dll to C:\ioBroker\node_modules\iobroker.roomba\node_modules\canvas\build\Release
                                  \libgthread-2.0-0.dll
                                  1 Datei(en) kopiert.
                                  Copying C:/GTK/bin/libpangowin32-1.0-0.dll to C:\ioBroker\node_modules\iobroker.roomba\node_modules\canvas\build\Rele
                                  ase\libpangowin32-1.0-0.dll
                                  1 Datei(en) kopiert.
                                  Copying C:/GTK/bin/libglib-2.0-0.dll to C:\ioBroker\node_modules\iobroker.roomba\node_modules\canvas\build\Release\l
                                  ibglib-2.0-0.dll
                                  1 Datei(en) kopiert.
                                  Copying C:/GTK/bin/libcairo-2.dll to C:\ioBroker\node_modules\iobroker.roomba\node_modules\canvas\build\Release\libc
                                  airo-2.dll
                                  1 Datei(en) kopiert.
                                  Copying C:/GTK/bin/libpango-1.0-0.dll to C:\ioBroker\node_modules\iobroker.roomba\node_modules\canvas\build\Release\
                                  libpango-1.0-0.dll
                                  1 Datei(en) kopiert.
                                  Copying C:/GTK/bin/libfontconfig-1.dll to C:\ioBroker\node_modules\iobroker.roomba\node_modules\canvas\build\Release
                                  \libfontconfig-1.dll
                                  1 Datei(en) kopiert.
                                  Copying C:/GTK/bin/libintl-8.dll to C:\ioBroker\node_modules\iobroker.roomba\node_modules\canvas\build\Release\libin
                                  tl-8.dll
                                  Das System kann die angegebene Datei nicht finden.
                                  Copying C:/GTK/bin/libfreetype-6.dll to C:\ioBroker\node_modules\iobroker.roomba\node_modules\canvas\build\Release\l
                                  ibfreetype-6.dll
                                  Das System kann die angegebene Datei nicht finden.
                                  Copying C:/GTK/bin/libgmodule-2.0-0.dll to C:\ioBroker\node_modules\iobroker.roomba\node_modules\canvas\build\Release
                                  \libgmodule-2.0-0.dll
                                  1 Datei(en) kopiert.
                                  Copying C:/GTK/bin/libpangocairo-1.0-0.dll to C:\ioBroker\node_modules\iobroker.roomba\node_modules\canvas\build\Rele
                                  ase\libpangocairo-1.0-0.dll
                                  1 Datei(en) kopiert.
                                  Copying C:/GTK/bin/libgobject-2.0-0.dll to C:\ioBroker\node_modules\iobroker.roomba\node_modules\canvas\build\Release
                                  \libgobject-2.0-0.dll
                                  1 Datei(en) kopiert.
                                  Copying C:/GTK/bin/libpng14-14.dll to C:\ioBroker\node_modules\iobroker.roomba\node_modules\canvas\build\Release\lib
                                  png14-14.dll
                                  1 Datei(en) kopiert.
                                  Copying C:/GTK/bin/zlib1.dll to C:\ioBroker\node_modules\iobroker.roomba\node_modules\canvas\build\Release\zlib1.dll
                                  1 Datei(en) kopiert.
                                  Copying C:/GTK/bin/libexpat-1.dll to C:\ioBroker\node_modules\iobroker.roomba\node_modules\canvas\build\Release\libe
                                  xpat-1.dll
                                  1 Datei(en) kopiert.
                                  win_delay_load_hook.cc
                                  Code wird generiert.
                                  All 1 functions were compiled because no usable IPDB/IOBJ from previous compilation was found.
                                  Codegenerierung ist abgeschlossen.
                                  canvas-postbuild.vcxproj -> C:\ioBroker\node_modules\iobroker.roomba\node_modules\canvas\build\Release\canvas-postbu
                                  ild.node
                                  npm WARN optional SKIPPING OPTIONAL DEPENDENCY: fsevents@1.2.9 (node_modules\fsevents):
                                  npm WARN notsup SKIPPING OPTIONAL DEPENDENCY: Unsupported platform for fsevents@1.2.9: wanted {"os":"darwin","arch":"any"} (current: {"os":"win32","arch":"ia32"})

                                  • canvas@2.6.0
                                    added 379 packages from 1042 contributors, updated 1 package and audited 7531 packages in 45.46s
                                    found 0 vulnerabilities

                                  C:\ioBroker\node_modules\iobroker.roomba>

                                  Ich bin mit meinem Latein echt am Ende.

                                  ioBroker auf Intel Core i3-5005U NUC und Windwos10 Pro

                                  ZefauZ 2 Antworten Letzte Antwort
                                  0
                                  • JB_SullivanJ JB_Sullivan

                                    So der Spaß geht weiter - nachdem ich nun den Schritt gegangen bin und ein altes Backup eingespielt habe (vom19.08.2019) bin ich überhaupt nicht mehr in der Lage den roomba Adapter upzudaten oder ihn zu installieren.

                                    Es kommen Fehlermeldungen on Mass:

                                    Beim Versuch den Adpter über Admin auf 1.0.6 hoch zu ziehen:


                                    $ ./iobroker upgrade roomba
                                    Update roomba from @1.0.4 to @1.0.6
                                    NPM version: 6.9.0
                                    npm install iobroker.roomba@1.0.6 --production --save --prefix "C:/ioBroker" (System call)
                                    npm
                                    WARN rollback Rolling back iobroker.roomba@1.0.6 failed (this is probably harmless): EBUSY: resource busy or locked, rmdir 'C:\ioBroker\node_modules\iobroker.roomba'
                                    npm
                                    ERR! path C:\ioBroker\node_modules\iobroker.roombanpm
                                    ERR! code
                                    EBUSY
                                    npm

                                    ERR!

                                    errno
                                    -4082
                                    npm

                                    ERR!

                                    syscall
                                    rename
                                    npm ERR!
                                    EBUSY: resource busy or locked, rename 'C:\ioBroker\node_modules\iobroker.roomba' -> 'C:\ioBroker\node_modules.iobroker.roomba.DELETE'

                                    npm ERR! A complete log of this run can be found in:npm ERR! C:\WINDOWS\system32\config\systemprofile\AppData\Roaming\npm-cache_logs\2019-08-30T05_25_49_712Z-debug.log

                                    ERROR: host.iobroker Cannot install iobroker.roomba@1.0.6: 4294963214
                                    ERROR: process exited with code 25

                                    Und hier ein paar Meldungen wenn man versucht den Canvas Adapter gemäß GitHub Beschreibung zu installieren.


                                    C:\ioBroker\node_modules\iobroker.roomba>npm install canvas

                                    canvas@2.6.0 install C:\ioBroker\node_modules\iobroker.roomba\node_modules\canvas
                                    node-pre-gyp install --fallback-to-build

                                    node-pre-gyp WARN Using request for node-pre-gyp https download
                                    node-pre-gyp WARN Tried to download(404): https://github.com/node-gfx/node-canvas-prebuilt/releases/download/v2.6.0/canvas-v2.6.0-node-v64-win32-unknown-ia32.tar.gz
                                    node-pre-gyp WARN Pre-built binaries not found for canvas@2.6.0 and node@10.16.0 (node-v64 ABI, unknown) (falling back to source compile with node-gyp)
                                    Warning: Missing input files:
                                    C:\GTK\bin\libfreetype-6.dll
                                    C:\GTK\bin\libintl-8.dll
                                    Die Projekte in dieser Projektmappe werden nacheinander erstellt. Um eine parallele Erstellung zu ermöglichen, müssen Sie den Schalter "/m" hinzufügen.
                                    Copying C:/libjpeg-turbo/bin/jpeg62.dll to C:\ioBroker\node_modules\iobroker.roomba\node_modules\canvas\build\Release
                                    \jpeg62.dll
                                    1 Datei(en) kopiert.
                                    Backend.cc
                                    ImageBackend.cc
                                    PdfBackend.cc
                                    SvgBackend.cc
                                    BMPParser.cc
                                    Backends.cc
                                    c:\iobroker\node_modules\iobroker.roomba\node_modules\canvas\src\bmp\bmpparser.cc(189): warning C4018: ">": Konflikt zw
                                    ischen "signed" und "unsigned" [C:\ioBroker\node_modules\iobroker.roomba\node_modules\canvas\build\canvas.vcxproj]
                                    c:\iobroker\node_modules\iobroker.roomba\node_modules\canvas\src\bmp\bmpparser.cc(204): warning C4018: ">": Konflikt zw
                                    ischen "signed" und "unsigned" [C:\ioBroker\node_modules\iobroker.roomba\node_modules\canvas\build\canvas.vcxproj]
                                    Canvas.cc
                                    CanvasGradient.cc
                                    CanvasPattern.cc
                                    CanvasRenderingContext2d.cc
                                    closure.cc
                                    color.cc
                                    Image.cc
                                    ImageData.cc
                                    init.cc
                                    register_font.cc
                                    win_delay_load_hook.cc
                                    Bibliothek "C:\ioBroker\node_modules\iobroker.roomba\node_modules\canvas\build\Release\canvas.lib" und Objekt "C:
                                    ioBroker\node_modules\iobroker.roomba\node_modules\canvas\build\Release\canvas.exp" werden erstellt.
                                    Code wird generiert.
                                    All 2104 functions were compiled because no usable IPDB/IOBJ from previous compilation was found.
                                    Codegenerierung ist abgeschlossen.
                                    canvas.vcxproj -> C:\ioBroker\node_modules\iobroker.roomba\node_modules\canvas\build\Release\canvas.node
                                    Copying C:/GTK/bin/libpangoft2-1.0-0.dll to C:\ioBroker\node_modules\iobroker.roomba\node_modules\canvas\build\Releas
                                    e\libpangoft2-1.0-0.dll
                                    1 Datei(en) kopiert.
                                    Copying C:/GTK/bin/libgthread-2.0-0.dll to C:\ioBroker\node_modules\iobroker.roomba\node_modules\canvas\build\Release
                                    \libgthread-2.0-0.dll
                                    1 Datei(en) kopiert.
                                    Copying C:/GTK/bin/libpangowin32-1.0-0.dll to C:\ioBroker\node_modules\iobroker.roomba\node_modules\canvas\build\Rele
                                    ase\libpangowin32-1.0-0.dll
                                    1 Datei(en) kopiert.
                                    Copying C:/GTK/bin/libglib-2.0-0.dll to C:\ioBroker\node_modules\iobroker.roomba\node_modules\canvas\build\Release\l
                                    ibglib-2.0-0.dll
                                    1 Datei(en) kopiert.
                                    Copying C:/GTK/bin/libcairo-2.dll to C:\ioBroker\node_modules\iobroker.roomba\node_modules\canvas\build\Release\libc
                                    airo-2.dll
                                    1 Datei(en) kopiert.
                                    Copying C:/GTK/bin/libpango-1.0-0.dll to C:\ioBroker\node_modules\iobroker.roomba\node_modules\canvas\build\Release\
                                    libpango-1.0-0.dll
                                    1 Datei(en) kopiert.
                                    Copying C:/GTK/bin/libfontconfig-1.dll to C:\ioBroker\node_modules\iobroker.roomba\node_modules\canvas\build\Release
                                    \libfontconfig-1.dll
                                    1 Datei(en) kopiert.
                                    Copying C:/GTK/bin/libintl-8.dll to C:\ioBroker\node_modules\iobroker.roomba\node_modules\canvas\build\Release\libin
                                    tl-8.dll
                                    Das System kann die angegebene Datei nicht finden.
                                    Copying C:/GTK/bin/libfreetype-6.dll to C:\ioBroker\node_modules\iobroker.roomba\node_modules\canvas\build\Release\l
                                    ibfreetype-6.dll
                                    Das System kann die angegebene Datei nicht finden.
                                    Copying C:/GTK/bin/libgmodule-2.0-0.dll to C:\ioBroker\node_modules\iobroker.roomba\node_modules\canvas\build\Release
                                    \libgmodule-2.0-0.dll
                                    1 Datei(en) kopiert.
                                    Copying C:/GTK/bin/libpangocairo-1.0-0.dll to C:\ioBroker\node_modules\iobroker.roomba\node_modules\canvas\build\Rele
                                    ase\libpangocairo-1.0-0.dll
                                    1 Datei(en) kopiert.
                                    Copying C:/GTK/bin/libgobject-2.0-0.dll to C:\ioBroker\node_modules\iobroker.roomba\node_modules\canvas\build\Release
                                    \libgobject-2.0-0.dll
                                    1 Datei(en) kopiert.
                                    Copying C:/GTK/bin/libpng14-14.dll to C:\ioBroker\node_modules\iobroker.roomba\node_modules\canvas\build\Release\lib
                                    png14-14.dll
                                    1 Datei(en) kopiert.
                                    Copying C:/GTK/bin/zlib1.dll to C:\ioBroker\node_modules\iobroker.roomba\node_modules\canvas\build\Release\zlib1.dll
                                    1 Datei(en) kopiert.
                                    Copying C:/GTK/bin/libexpat-1.dll to C:\ioBroker\node_modules\iobroker.roomba\node_modules\canvas\build\Release\libe
                                    xpat-1.dll
                                    1 Datei(en) kopiert.
                                    win_delay_load_hook.cc
                                    Code wird generiert.
                                    All 1 functions were compiled because no usable IPDB/IOBJ from previous compilation was found.
                                    Codegenerierung ist abgeschlossen.
                                    canvas-postbuild.vcxproj -> C:\ioBroker\node_modules\iobroker.roomba\node_modules\canvas\build\Release\canvas-postbu
                                    ild.node
                                    npm WARN optional SKIPPING OPTIONAL DEPENDENCY: fsevents@1.2.9 (node_modules\fsevents):
                                    npm WARN notsup SKIPPING OPTIONAL DEPENDENCY: Unsupported platform for fsevents@1.2.9: wanted {"os":"darwin","arch":"any"} (current: {"os":"win32","arch":"ia32"})

                                    • canvas@2.6.0
                                      added 379 packages from 1042 contributors, updated 1 package and audited 7531 packages in 45.46s
                                      found 0 vulnerabilities

                                    C:\ioBroker\node_modules\iobroker.roomba>

                                    Ich bin mit meinem Latein echt am Ende.

                                    ZefauZ Offline
                                    ZefauZ Offline
                                    Zefau
                                    schrieb am zuletzt editiert von
                                    #301

                                    @JB_Sullivan also canvas ist erfolgreich installiert. Am Anfang nur ein 404, weil er den prebuilt nicht gefunden hat. Danach wurde es selbst kompiliert und das war erfolgreich.

                                    Probier sonst mal mit v1.0.4 auf Debug den Roomba los zu schicken.

                                    Das Update auf 1.0.6 zeigt den Fehler EBUSY: resource busy or locked. Das heißt eine Ressource greift bereits darauf zu. Kannst du den Rechner mit ioBroker mal neustarten und dann nochmal probieren?

                                    Meine Adapter: https://zefau.github.io/iobroker/

                                    1 Antwort Letzte Antwort
                                    0
                                    • JB_SullivanJ JB_Sullivan

                                      So der Spaß geht weiter - nachdem ich nun den Schritt gegangen bin und ein altes Backup eingespielt habe (vom19.08.2019) bin ich überhaupt nicht mehr in der Lage den roomba Adapter upzudaten oder ihn zu installieren.

                                      Es kommen Fehlermeldungen on Mass:

                                      Beim Versuch den Adpter über Admin auf 1.0.6 hoch zu ziehen:


                                      $ ./iobroker upgrade roomba
                                      Update roomba from @1.0.4 to @1.0.6
                                      NPM version: 6.9.0
                                      npm install iobroker.roomba@1.0.6 --production --save --prefix "C:/ioBroker" (System call)
                                      npm
                                      WARN rollback Rolling back iobroker.roomba@1.0.6 failed (this is probably harmless): EBUSY: resource busy or locked, rmdir 'C:\ioBroker\node_modules\iobroker.roomba'
                                      npm
                                      ERR! path C:\ioBroker\node_modules\iobroker.roombanpm
                                      ERR! code
                                      EBUSY
                                      npm

                                      ERR!

                                      errno
                                      -4082
                                      npm

                                      ERR!

                                      syscall
                                      rename
                                      npm ERR!
                                      EBUSY: resource busy or locked, rename 'C:\ioBroker\node_modules\iobroker.roomba' -> 'C:\ioBroker\node_modules.iobroker.roomba.DELETE'

                                      npm ERR! A complete log of this run can be found in:npm ERR! C:\WINDOWS\system32\config\systemprofile\AppData\Roaming\npm-cache_logs\2019-08-30T05_25_49_712Z-debug.log

                                      ERROR: host.iobroker Cannot install iobroker.roomba@1.0.6: 4294963214
                                      ERROR: process exited with code 25

                                      Und hier ein paar Meldungen wenn man versucht den Canvas Adapter gemäß GitHub Beschreibung zu installieren.


                                      C:\ioBroker\node_modules\iobroker.roomba>npm install canvas

                                      canvas@2.6.0 install C:\ioBroker\node_modules\iobroker.roomba\node_modules\canvas
                                      node-pre-gyp install --fallback-to-build

                                      node-pre-gyp WARN Using request for node-pre-gyp https download
                                      node-pre-gyp WARN Tried to download(404): https://github.com/node-gfx/node-canvas-prebuilt/releases/download/v2.6.0/canvas-v2.6.0-node-v64-win32-unknown-ia32.tar.gz
                                      node-pre-gyp WARN Pre-built binaries not found for canvas@2.6.0 and node@10.16.0 (node-v64 ABI, unknown) (falling back to source compile with node-gyp)
                                      Warning: Missing input files:
                                      C:\GTK\bin\libfreetype-6.dll
                                      C:\GTK\bin\libintl-8.dll
                                      Die Projekte in dieser Projektmappe werden nacheinander erstellt. Um eine parallele Erstellung zu ermöglichen, müssen Sie den Schalter "/m" hinzufügen.
                                      Copying C:/libjpeg-turbo/bin/jpeg62.dll to C:\ioBroker\node_modules\iobroker.roomba\node_modules\canvas\build\Release
                                      \jpeg62.dll
                                      1 Datei(en) kopiert.
                                      Backend.cc
                                      ImageBackend.cc
                                      PdfBackend.cc
                                      SvgBackend.cc
                                      BMPParser.cc
                                      Backends.cc
                                      c:\iobroker\node_modules\iobroker.roomba\node_modules\canvas\src\bmp\bmpparser.cc(189): warning C4018: ">": Konflikt zw
                                      ischen "signed" und "unsigned" [C:\ioBroker\node_modules\iobroker.roomba\node_modules\canvas\build\canvas.vcxproj]
                                      c:\iobroker\node_modules\iobroker.roomba\node_modules\canvas\src\bmp\bmpparser.cc(204): warning C4018: ">": Konflikt zw
                                      ischen "signed" und "unsigned" [C:\ioBroker\node_modules\iobroker.roomba\node_modules\canvas\build\canvas.vcxproj]
                                      Canvas.cc
                                      CanvasGradient.cc
                                      CanvasPattern.cc
                                      CanvasRenderingContext2d.cc
                                      closure.cc
                                      color.cc
                                      Image.cc
                                      ImageData.cc
                                      init.cc
                                      register_font.cc
                                      win_delay_load_hook.cc
                                      Bibliothek "C:\ioBroker\node_modules\iobroker.roomba\node_modules\canvas\build\Release\canvas.lib" und Objekt "C:
                                      ioBroker\node_modules\iobroker.roomba\node_modules\canvas\build\Release\canvas.exp" werden erstellt.
                                      Code wird generiert.
                                      All 2104 functions were compiled because no usable IPDB/IOBJ from previous compilation was found.
                                      Codegenerierung ist abgeschlossen.
                                      canvas.vcxproj -> C:\ioBroker\node_modules\iobroker.roomba\node_modules\canvas\build\Release\canvas.node
                                      Copying C:/GTK/bin/libpangoft2-1.0-0.dll to C:\ioBroker\node_modules\iobroker.roomba\node_modules\canvas\build\Releas
                                      e\libpangoft2-1.0-0.dll
                                      1 Datei(en) kopiert.
                                      Copying C:/GTK/bin/libgthread-2.0-0.dll to C:\ioBroker\node_modules\iobroker.roomba\node_modules\canvas\build\Release
                                      \libgthread-2.0-0.dll
                                      1 Datei(en) kopiert.
                                      Copying C:/GTK/bin/libpangowin32-1.0-0.dll to C:\ioBroker\node_modules\iobroker.roomba\node_modules\canvas\build\Rele
                                      ase\libpangowin32-1.0-0.dll
                                      1 Datei(en) kopiert.
                                      Copying C:/GTK/bin/libglib-2.0-0.dll to C:\ioBroker\node_modules\iobroker.roomba\node_modules\canvas\build\Release\l
                                      ibglib-2.0-0.dll
                                      1 Datei(en) kopiert.
                                      Copying C:/GTK/bin/libcairo-2.dll to C:\ioBroker\node_modules\iobroker.roomba\node_modules\canvas\build\Release\libc
                                      airo-2.dll
                                      1 Datei(en) kopiert.
                                      Copying C:/GTK/bin/libpango-1.0-0.dll to C:\ioBroker\node_modules\iobroker.roomba\node_modules\canvas\build\Release\
                                      libpango-1.0-0.dll
                                      1 Datei(en) kopiert.
                                      Copying C:/GTK/bin/libfontconfig-1.dll to C:\ioBroker\node_modules\iobroker.roomba\node_modules\canvas\build\Release
                                      \libfontconfig-1.dll
                                      1 Datei(en) kopiert.
                                      Copying C:/GTK/bin/libintl-8.dll to C:\ioBroker\node_modules\iobroker.roomba\node_modules\canvas\build\Release\libin
                                      tl-8.dll
                                      Das System kann die angegebene Datei nicht finden.
                                      Copying C:/GTK/bin/libfreetype-6.dll to C:\ioBroker\node_modules\iobroker.roomba\node_modules\canvas\build\Release\l
                                      ibfreetype-6.dll
                                      Das System kann die angegebene Datei nicht finden.
                                      Copying C:/GTK/bin/libgmodule-2.0-0.dll to C:\ioBroker\node_modules\iobroker.roomba\node_modules\canvas\build\Release
                                      \libgmodule-2.0-0.dll
                                      1 Datei(en) kopiert.
                                      Copying C:/GTK/bin/libpangocairo-1.0-0.dll to C:\ioBroker\node_modules\iobroker.roomba\node_modules\canvas\build\Rele
                                      ase\libpangocairo-1.0-0.dll
                                      1 Datei(en) kopiert.
                                      Copying C:/GTK/bin/libgobject-2.0-0.dll to C:\ioBroker\node_modules\iobroker.roomba\node_modules\canvas\build\Release
                                      \libgobject-2.0-0.dll
                                      1 Datei(en) kopiert.
                                      Copying C:/GTK/bin/libpng14-14.dll to C:\ioBroker\node_modules\iobroker.roomba\node_modules\canvas\build\Release\lib
                                      png14-14.dll
                                      1 Datei(en) kopiert.
                                      Copying C:/GTK/bin/zlib1.dll to C:\ioBroker\node_modules\iobroker.roomba\node_modules\canvas\build\Release\zlib1.dll
                                      1 Datei(en) kopiert.
                                      Copying C:/GTK/bin/libexpat-1.dll to C:\ioBroker\node_modules\iobroker.roomba\node_modules\canvas\build\Release\libe
                                      xpat-1.dll
                                      1 Datei(en) kopiert.
                                      win_delay_load_hook.cc
                                      Code wird generiert.
                                      All 1 functions were compiled because no usable IPDB/IOBJ from previous compilation was found.
                                      Codegenerierung ist abgeschlossen.
                                      canvas-postbuild.vcxproj -> C:\ioBroker\node_modules\iobroker.roomba\node_modules\canvas\build\Release\canvas-postbu
                                      ild.node
                                      npm WARN optional SKIPPING OPTIONAL DEPENDENCY: fsevents@1.2.9 (node_modules\fsevents):
                                      npm WARN notsup SKIPPING OPTIONAL DEPENDENCY: Unsupported platform for fsevents@1.2.9: wanted {"os":"darwin","arch":"any"} (current: {"os":"win32","arch":"ia32"})

                                      • canvas@2.6.0
                                        added 379 packages from 1042 contributors, updated 1 package and audited 7531 packages in 45.46s
                                        found 0 vulnerabilities

                                      C:\ioBroker\node_modules\iobroker.roomba>

                                      Ich bin mit meinem Latein echt am Ende.

                                      ZefauZ Offline
                                      ZefauZ Offline
                                      Zefau
                                      schrieb am zuletzt editiert von
                                      #302

                                      @JB_Sullivan Versuche den Adapter über die Windows Konsole (Start -> cmd -> Als Administrator ausführen) upzudaten.

                                      In der Konsole in das ioBroker Verzeichnis wechseln (mit cd C:\iobroker oder wie der Pfad auch ist) und dann dort folgende Befehle ausführen:

                                      iobroker url https://github.com/Zefau/ioBroker.roomba
                                      iobroker upload roomba
                                      

                                      Meine Adapter: https://zefau.github.io/iobroker/

                                      1 Antwort Letzte Antwort
                                      0
                                      • JB_SullivanJ Offline
                                        JB_SullivanJ Offline
                                        JB_Sullivan
                                        schrieb am zuletzt editiert von JB_Sullivan
                                        #303

                                        So ich habe es so gemacht wie du geschrieben hast.

                                        Ein Problem scheint zu sein, das der ioBroker Admin nicht mehr richtig erkennt, welche Version überhaupt installiert ist.

                                        Er zeigt mir 1.0.4 an in Wirklichkeit ist aber 1.0.6 drauf und wenn ich dann auf Akutalisieren klicke schreibt er auch, das alles Up-To-Date ist

                                        2019-08-30 22_50_23-adapters - ioBroker.png 2019-08-30 22_50_45-adapters - ioBroker.png

                                        Nach wie vor besteht noch das Problem, das ich keine Verbindung vom Adapter zum Roomba bekomme. Weder Automatisch (wlan Taste), noch mit dem bekannten Benutzernamen, Passwort und IP Adresse. Der Adapter flasht kurz grün auf, wird dann aber wieder rot und er schreibt mir das ich den Adapter starten soll, obwohl dieser bereits läuft (aber rot ist).

                                        2019-08-30 22_51_59-instances - ioBroker.png

                                        und im Log schreibt er mir noch immer, das Canvas nicht installiert ist. Hier sieht man auch nochmal, das Version 1.0.6 drauf ist. Im ioBroker wird aber immer noch 1.0.4 angezeigt. Ich habe aktualisiert und den Upload gemacht - das Ergbenis ist das gleiche.

                                        roomba.0	2019-08-30 22:51:40.007	debug	Message: {"command":"getRobotData","message":null,"from":"system.adapter.admin.0","callback":{"message":null,"id":14,"ack":false,"time":1567198300008},"_id":42014206}
                                        roomba.0	2019-08-30 22:51:15.683	warn	Username, password and / or ip address missing!
                                        roomba.0	2019-08-30 22:51:15.683	debug	\\?\C:\ioBroker\node_modules\iobroker.roomba\node_modules\canvas\build\Release\canvas.node
                                        roomba.0	2019-08-30 22:51:15.683	debug	Das angegebene Modul wurde nicht gefunden.
                                        roomba.0	2019-08-30 22:51:15.683	warn	Canvas not installed! Thus, no map drawings are possible.
                                        roomba.0	2019-08-30 22:51:15.527	info	starting. Version 1.0.6 in C:/ioBroker/node_modules/iobroker.roomba, node: v10.16.0
                                        roomba.0	2019-08-30 22:51:15.418	debug	statesDB connected
                                        roomba.0	2019-08-30 22:51:15.386	debug	objectDB connected
                                        

                                        Ich weiß auch nicht warum er das angeblich fehlende canvas.node nicht findet. Es ist nämlich an dem angegebenen Ort vorhanden.

                                        2019-08-31 07_56_02-10.122.60.63 - Remotedesktopverbindung.png

                                        ioBroker auf Intel Core i3-5005U NUC und Windwos10 Pro

                                        1 Antwort Letzte Antwort
                                        0
                                        • JB_SullivanJ Offline
                                          JB_SullivanJ Offline
                                          JB_Sullivan
                                          schrieb am zuletzt editiert von JB_Sullivan
                                          #304

                                          Ich bin immer noch / wieder dran.

                                          Ich habe diese Inkonsistenz mit der Angezeigten und realen Version weg bekommen, indem ich den Adapter händisch aus dem model_nodes Verzeichnis gelöscht habe und dann im Admin nochmal einen Löschvorgang angestoßen haben.

                                          2019-08-31 08_57_19-adapters - ioBroker.png

                                          Nun habe ich wie von dir oben beschrieben das ganze über die Eingabeaufforderung installiert. Da bekomme ich folgene Fehlermeldung.

                                          iobroker 2019-08-31 09:05:25.288 error system.adapter.roomba does not exist

                                          Jetzt wird aber auf jeden Fall im ioB Admin die richtige Version 1.0.6 angezeigt. Ich habe jetzt einen Upload ausgeführt, aber noch keine Instanz angelegt.

                                          Als nächstes habe ich wie auf Github beschrieben die Canvas Installation angestoßen. Ich habe die 32 Bit Version herunter geladen die nur GTK heißt in einem entsprechenden Ordner im C: Hauptverzeichnis abgelegt wurde. Siehe hier im Code, den ich so geändert habe, wie es bei passt.

                                          Windows
                                          Make sure you have node-gyp installed via
                                          
                                          npm install -g node-gyp
                                          Make sure you have build essentials installed via
                                          
                                          npm install --global --production windows-build-tools
                                          Download GTK 2 (for Win32 or Win64) and unzip it (e.g. to C:\path\to\GTK2)
                                          
                                          Run
                                          
                                          node-gyp rebuild --GTK_Root=C:\GTK
                                          Install canvas from within the iobroker.roomba folder
                                          
                                          cd C:\path\to\iobroker\node_modules\iobroker.roomba
                                          npm install canvas
                                          

                                          Beim 4. Schritt habe ich schon wieder Fehlermeldungen bekommen:

                                          C:\ioBroker>node-gyp rebuild --GTK_Root=C:\GTK
                                          gyp info it worked if it ends with ok
                                          gyp info using node-gyp@5.0.3
                                          gyp info using node@10.16.0 | win32 | ia32
                                          gyp info find Python using Python version 2.7.15 found at "C:\Program Files\Python\python.exe"
                                          gyp info find VS using VS2017 (15.9.28307.812) found at:
                                          gyp info find VS "C:\Program Files\Microsoft Visual Studio\2017\BuildTools"
                                          gyp info find VS run with --verbose for detailed information
                                          gyp info spawn C:\Program Files\Python\python.exe
                                          gyp info spawn args [ 'C:\\Users\\SmartHome\\AppData\\Roaming\\npm\\node_modules\\node-gyp\\gyp\\gyp_main.py',
                                          gyp info spawn args   'binding.gyp',
                                          gyp info spawn args   '-f',
                                          gyp info spawn args   'msvs',
                                          gyp info spawn args   '-I',
                                          gyp info spawn args   'C:\\ioBroker\\build\\config.gypi',
                                          gyp info spawn args   '-I',
                                          gyp info spawn args   'C:\\Users\\SmartHome\\AppData\\Roaming\\npm\\node_modules\\node-gyp\\addon.gypi',
                                          gyp info spawn args   '-I',
                                          gyp info spawn args   'C:\\Users\\SmartHome\\AppData\\Local\\node-gyp\\Cache\\10.16.0\\include\\node\\common.gypi',
                                          gyp info spawn args   '-Dlibrary=shared_library',
                                          gyp info spawn args   '-Dvisibility=default',
                                          gyp info spawn args   '-Dnode_root_dir=C:\\Users\\SmartHome\\AppData\\Local\\node-gyp\\Cache\\10.16.0',
                                          gyp info spawn args   '-Dnode_gyp_dir=C:\\Users\\SmartHome\\AppData\\Roaming\\npm\\node_modules\\node-gyp',
                                          gyp info spawn args   '-Dnode_lib_file=C:\\Users\\SmartHome\\AppData\\Local\\node-gyp\\Cache\\10.16.0\\<(target_arch)\\node.lib',
                                          gyp info spawn args   '-Dmodule_root_dir=C:\\ioBroker',
                                          gyp info spawn args   '-Dnode_engine=v8',
                                          gyp info spawn args   '--depth=.',
                                          gyp info spawn args   '--no-parallel',
                                          gyp info spawn args   '--generator-output',
                                          gyp info spawn args   'C:\\ioBroker\\build',
                                          gyp info spawn args   '-Goutput_dir=.' ]
                                          gyp: binding.gyp not found (cwd: C:\ioBroker) while trying to load binding.gyp
                                          gyp ERR! configure error
                                          gyp ERR! stack Error: `gyp` failed with exit code: 1
                                          gyp ERR! stack     at ChildProcess.onCpExit (C:\Users\SmartHome\AppData\Roaming\npm\node_modules\node-gyp\lib\configure.js:344:16)
                                          gyp ERR! stack     at ChildProcess.emit (events.js:198:13)
                                          gyp ERR! stack     at Process.ChildProcess._handle.onexit (internal/child_process.js:248:12)
                                          gyp ERR! System Windows_NT 10.0.17763
                                          gyp ERR! command "C:\\Program Files\\nodejs\\node.exe" "C:\\Users\\SmartHome\\AppData\\Roaming\\npm\\node_modules\\node-gyp\\bin\\node-gyp.js" "rebuild" "--GTK_Root=C:\\GTK"
                                          gyp ERR! cwd C:\ioBroker
                                          gyp ERR! node -v v10.16.0
                                          gyp ERR! node-gyp -v v5.0.3
                                          gyp ERR! not ok
                                          

                                          Offensichtlich scheitert es am gyp Binding. Dieses ist aber sauber(?) durchgelaufen (Schritt 1)

                                          C:\ioBroker>npm install -g node-gyp
                                          C:\Users\SmartHome\AppData\Roaming\npm\node-gyp -> C:\Users\SmartHome\AppData\Roaming\npm\node_modules\node-gyp\bin\node-gyp.js
                                          + node-gyp@5.0.3
                                          updated 1 package in 4.406s
                                          

                                          So zum Schluss noch Canavas installiert, was auch immer wieder die gleichen Fehlermeldungen produziert.


                                          C:\ioBroker\node_modules\iobroker.roomba>npm install canvas

                                          canvas@2.6.0 install C:\ioBroker\node_modules\iobroker.roomba\node_modules\canvas
                                          node-pre-gyp install --fallback-to-build

                                          node-pre-gyp WARN Using request for node-pre-gyp https download
                                          node-pre-gyp WARN Tried to download(404): https://github.com/node-gfx/node-canvas-prebuilt/releases/download/v2.6.0/canvas-v2.6.0-node-v64-win32-unknown-ia32.tar.gz
                                          node-pre-gyp WARN Pre-built binaries not found for canvas@2.6.0 and node@10.16.0 (node-v64 ABI, unknown) (falling back to source compile with node-gyp)
                                          Warning: Missing input files:
                                          C:\GTK\bin\libfreetype-6.dll
                                          C:\GTK\bin\libintl-8.dll
                                          Die Projekte in dieser Projektmappe werden nacheinander erstellt. Um eine parallele Erstellung zu ermöglichen, müssen Sie den Schalter "/m" hinzufügen.
                                          Copying C:/libjpeg-turbo/bin/jpeg62.dll to C:\ioBroker\node_modules\iobroker.roomba\node_modules\canvas\build\Release
                                          \jpeg62.dll
                                          1 Datei(en) kopiert.
                                          Backend.cc
                                          ImageBackend.cc
                                          PdfBackend.cc
                                          SvgBackend.cc
                                          BMPParser.cc
                                          Backends.cc
                                          c:\iobroker\node_modules\iobroker.roomba\node_modules\canvas\src\bmp\bmpparser.cc(189): warning C4018: ">": Konflikt zw
                                          ischen "signed" und "unsigned" [C:\ioBroker\node_modules\iobroker.roomba\node_modules\canvas\build\canvas.vcxproj]
                                          c:\iobroker\node_modules\iobroker.roomba\node_modules\canvas\src\bmp\bmpparser.cc(204): warning C4018: ">": Konflikt zw
                                          ischen "signed" und "unsigned" [C:\ioBroker\node_modules\iobroker.roomba\node_modules\canvas\build\canvas.vcxproj]
                                          Canvas.cc
                                          CanvasGradient.cc
                                          CanvasPattern.cc
                                          CanvasRenderingContext2d.cc
                                          closure.cc
                                          color.cc
                                          Image.cc
                                          ImageData.cc
                                          init.cc
                                          register_font.cc
                                          win_delay_load_hook.cc
                                          Bibliothek "C:\ioBroker\node_modules\iobroker.roomba\node_modules\canvas\build\Release\canvas.lib" und Objekt "C:
                                          ioBroker\node_modules\iobroker.roomba\node_modules\canvas\build\Release\canvas.exp" werden erstellt.
                                          Code wird generiert.
                                          All 2104 functions were compiled because no usable IPDB/IOBJ from previous compilation was found.
                                          Codegenerierung ist abgeschlossen.
                                          canvas.vcxproj -> C:\ioBroker\node_modules\iobroker.roomba\node_modules\canvas\build\Release\canvas.node
                                          Copying C:/GTK/bin/libpangoft2-1.0-0.dll to C:\ioBroker\node_modules\iobroker.roomba\node_modules\canvas\build\Releas
                                          e\libpangoft2-1.0-0.dll
                                          1 Datei(en) kopiert.
                                          Copying C:/GTK/bin/libgthread-2.0-0.dll to C:\ioBroker\node_modules\iobroker.roomba\node_modules\canvas\build\Release
                                          \libgthread-2.0-0.dll
                                          1 Datei(en) kopiert.
                                          Copying C:/GTK/bin/libpangowin32-1.0-0.dll to C:\ioBroker\node_modules\iobroker.roomba\node_modules\canvas\build\Rele
                                          ase\libpangowin32-1.0-0.dll
                                          1 Datei(en) kopiert.
                                          Copying C:/GTK/bin/libglib-2.0-0.dll to C:\ioBroker\node_modules\iobroker.roomba\node_modules\canvas\build\Release\l
                                          ibglib-2.0-0.dll
                                          1 Datei(en) kopiert.
                                          Copying C:/GTK/bin/libcairo-2.dll to C:\ioBroker\node_modules\iobroker.roomba\node_modules\canvas\build\Release\libc
                                          airo-2.dll
                                          1 Datei(en) kopiert.
                                          Copying C:/GTK/bin/libpango-1.0-0.dll to C:\ioBroker\node_modules\iobroker.roomba\node_modules\canvas\build\Release\
                                          libpango-1.0-0.dll
                                          1 Datei(en) kopiert.
                                          Copying C:/GTK/bin/libfontconfig-1.dll to C:\ioBroker\node_modules\iobroker.roomba\node_modules\canvas\build\Release
                                          \libfontconfig-1.dll
                                          1 Datei(en) kopiert.
                                          Copying C:/GTK/bin/libintl-8.dll to C:\ioBroker\node_modules\iobroker.roomba\node_modules\canvas\build\Release\libin
                                          tl-8.dll
                                          Das System kann die angegebene Datei nicht finden.
                                          Copying C:/GTK/bin/libfreetype-6.dll to C:\ioBroker\node_modules\iobroker.roomba\node_modules\canvas\build\Release\l
                                          ibfreetype-6.dll
                                          Das System kann die angegebene Datei nicht finden.
                                          Copying C:/GTK/bin/libgmodule-2.0-0.dll to C:\ioBroker\node_modules\iobroker.roomba\node_modules\canvas\build\Release
                                          \libgmodule-2.0-0.dll
                                          1 Datei(en) kopiert.
                                          Copying C:/GTK/bin/libpangocairo-1.0-0.dll to C:\ioBroker\node_modules\iobroker.roomba\node_modules\canvas\build\Rele
                                          ase\libpangocairo-1.0-0.dll
                                          1 Datei(en) kopiert.
                                          Copying C:/GTK/bin/libgobject-2.0-0.dll to C:\ioBroker\node_modules\iobroker.roomba\node_modules\canvas\build\Release
                                          \libgobject-2.0-0.dll
                                          1 Datei(en) kopiert.
                                          Copying C:/GTK/bin/libpng14-14.dll to C:\ioBroker\node_modules\iobroker.roomba\node_modules\canvas\build\Release\lib
                                          png14-14.dll
                                          1 Datei(en) kopiert.
                                          Copying C:/GTK/bin/zlib1.dll to C:\ioBroker\node_modules\iobroker.roomba\node_modules\canvas\build\Release\zlib1.dll
                                          1 Datei(en) kopiert.
                                          Copying C:/GTK/bin/libexpat-1.dll to C:\ioBroker\node_modules\iobroker.roomba\node_modules\canvas\build\Release\libe
                                          xpat-1.dll
                                          1 Datei(en) kopiert.
                                          win_delay_load_hook.cc
                                          Code wird generiert.
                                          All 1 functions were compiled because no usable IPDB/IOBJ from previous compilation was found.
                                          Codegenerierung ist abgeschlossen.
                                          canvas-postbuild.vcxproj -> C:\ioBroker\node_modules\iobroker.roomba\node_modules\canvas\build\Release\canvas-postbu
                                          ild.node
                                          npm WARN optional SKIPPING OPTIONAL DEPENDENCY: fsevents@1.2.9 (node_modules\fsevents):
                                          npm WARN notsup SKIPPING OPTIONAL DEPENDENCY: Unsupported platform for fsevents@1.2.9: wanted {"os":"darwin","arch":"any"} (current: {"os":"win32","arch":"ia32"})

                                          • canvas@2.6.0
                                            added 381 packages from 1033 contributors, removed 2 packages, updated 14 packages and audited 7482 packages in 49.906s
                                            found 0 vulnerabilities

                                          So, nun stehe ich wieder da wo ich die ganzen Tage schon dran rum mache - ich komme einfach nicht weiter. Es läuft immer wieder auf die selben Fehler hinaus.

                                          Dann habe ich eine Instanz angelegt. Aber hier wieder wie die ganze Zeit, keine Chance das der Adapter sich mit dem Roomba verbindet - immer mit dem Hinweis ich soll den bereits laufenden Adapter starten. Was dann im LOG zu diesen Fehlermeldungen führt.

                                          roomba.0	2019-08-31 09:32:49.663	info	Adapter stopped und unloaded.
                                          roomba.0	2019-08-31 09:32:49.663	error	at TLSWrap.onStreamRead [as onread] (internal/stream_base_commons.js:94:17)
                                          roomba.0	2019-08-31 09:32:49.663	error	at TLSSocket.Readable.push (_stream_readable.js:224:10)
                                          roomba.0	2019-08-31 09:32:49.663	error	at readableAddChunk (_stream_readable.js:269:11)
                                          roomba.0	2019-08-31 09:32:49.663	error	at addChunk (_stream_readable.js:288:12)
                                          roomba.0	2019-08-31 09:32:49.663	error	at TLSSocket.emit (events.js:198:13)
                                          roomba.0	2019-08-31 09:32:49.663	error	at TLSSocket.ondata (_stream_readable.js:693:20)
                                          roomba.0	2019-08-31 09:32:49.663	error	at Writable.write (C:\ioBroker\node_modules\iobroker.roomba\node_modules\readable-stream\lib\_stream_writable.js:334:11)
                                          roomba.0	2019-08-31 09:32:49.663	error	at writeOrBuffer (C:\ioBroker\node_modules\iobroker.roomba\node_modules\readable-stream\lib\_stream_writable.js:417:5)
                                          roomba.0	2019-08-31 09:32:49.663	error	at doWrite (C:\ioBroker\node_modules\iobroker.roomba\node_modules\readable-stream\lib\_stream_writable.js:428:64)
                                          roomba.0	2019-08-31 09:32:49.663	error	at Writable.writable._write (C:\ioBroker\node_modules\iobroker.roomba\node_modules\mqtt\lib\client.js:302:5)
                                          roomba.0	2019-08-31 09:32:49.663	error	at work (C:\ioBroker\node_modules\iobroker.roomba\node_modules\mqtt\lib\client.js:292:12)
                                          roomba.0	2019-08-31 09:32:49.663	error	at MqttClient._handlePacket (C:\ioBroker\node_modules\iobroker.roomba\node_modules\mqtt\lib\client.js:350:12)
                                          roomba.0	2019-08-31 09:32:49.663	error	at MqttClient._handleConnack (C:\ioBroker\node_modules\iobroker.roomba\node_modules\mqtt\lib\client.js:920:15)
                                          roomba.0	2019-08-31 09:32:49.663	error	Error: Connection refused: Not authorized
                                          roomba.0	2019-08-31 09:32:49.663	error	uncaught exception: Connection refused: Not authorized
                                          roomba.0	2019-08-31 09:32:47.835	info	Connecting to Roomba (10.122.60.10)..
                                          roomba.0	2019-08-31 09:32:47.835	warn	Canvas not installed! Thus, no map drawings are possible.
                                          roomba.0	2019-08-31 09:32:47.772	info	starting. Version 1.0.6 in C:/ioBroker/node_modules/iobroker.roomba, node: v10.16.0
                                          

                                          ioBroker auf Intel Core i3-5005U NUC und Windwos10 Pro

                                          1 Antwort Letzte Antwort
                                          0
                                          Antworten
                                          • In einem neuen Thema antworten
                                          Anmelden zum Antworten
                                          • Älteste zuerst
                                          • Neuste zuerst
                                          • Meiste Stimmen


                                          Support us

                                          ioBroker
                                          Community Adapters
                                          Donate
                                          FAQ Cloud / IOT
                                          HowTo: Node.js-Update
                                          HowTo: Backup/Restore
                                          Downloads
                                          BLOG

                                          368

                                          Online

                                          32.4k

                                          Benutzer

                                          81.5k

                                          Themen

                                          1.3m

                                          Beiträge
                                          Community
                                          Impressum | Datenschutz-Bestimmungen | Nutzungsbedingungen | Einwilligungseinstellungen
                                          ioBroker Community 2014-2025
                                          logo
                                          • Anmelden

                                          • Du hast noch kein Konto? Registrieren

                                          • Anmelden oder registrieren, um zu suchen
                                          • Erster Beitrag
                                            Letzter Beitrag
                                          0
                                          • Home
                                          • Aktuell
                                          • Tags
                                          • Ungelesen 0
                                          • Kategorien
                                          • Unreplied
                                          • Beliebt
                                          • GitHub
                                          • Docu
                                          • Hilfe