Skip to content
  • Home
  • Aktuell
  • Tags
  • 0 Ungelesen 0
  • Kategorien
  • Unreplied
  • Beliebt
  • GitHub
  • Docu
  • Hilfe
Skins
  • Light
  • Brite
  • Cerulean
  • Cosmo
  • Flatly
  • Journal
  • Litera
  • Lumen
  • Lux
  • Materia
  • Minty
  • Morph
  • Pulse
  • Sandstone
  • Simplex
  • Sketchy
  • Spacelab
  • United
  • Yeti
  • Zephyr
  • Dark
  • Cyborg
  • Darkly
  • Quartz
  • Slate
  • Solar
  • Superhero
  • Vapor

  • Standard: (Kein Skin)
  • Kein Skin
Einklappen
ioBroker Logo

Community Forum

donate donate
  1. ioBroker Community Home
  2. Deutsch
  3. Hardware
  4. SONOFF NSPanel mit Lovelace UI

NEWS

  • UPDATE 31.10.: Amazon Alexa - ioBroker Skill läuft aus ?
    apollon77A
    apollon77
    48
    3
    8.7k

  • Monatsrückblick – September 2025
    BluefoxB
    Bluefox
    13
    1
    2.2k

  • Neues Video "KI im Smart Home" - ioBroker plus n8n
    BluefoxB
    Bluefox
    16
    1
    3.1k

SONOFF NSPanel mit Lovelace UI

Geplant Angeheftet Gesperrt Verschoben Hardware
lovelace uinspanelsonoff
7.8k Beiträge 274 Kommentatoren 6.8m Aufrufe 257 Watching
  • Älteste zuerst
  • Neuste zuerst
  • Meiste Stimmen
Antworten
  • In einem neuen Thema antworten
Anmelden zum Antworten
Dieses Thema wurde gelöscht. Nur Nutzer mit entsprechenden Rechten können es sehen.
  • theknutT theknut

    @armilar Wenn ich den Screensaver berühre, dann geht das Display sofort aus, bleibt aus und dann kommt der Screensaver wieder. Manchmal sieht man noch kurz vorher das Service Menü, aber auch nur einen Bruchteil einer Sekunde.

    Wenn ich das Panel berühre erscheint folgende Meldung in der Tasmota Konsole

    23:12:17.087 MQT: tasmota/sonoff_nspanel_wohnzimmer/tele/RESULT = {"CustomRecv":"event,buttonPress2,screensaver,bExit,1"}
    

    Und diese im javascript Output im ioBroker

    24.11.2023, 22:58:14.869	[info ]: javascript.0 (2838) script.js.NSPanel.Wohnzimmer: getState(id=0_userdata.0.NSPanel.1.Config.Screensaver.screenSaverDoubleClick, timerId=undefined) => {"val":true,"ack":true,"ts":1700771421066,"q":0,"c":"script.js.NSPanel.Wohnzimmer","from":"system.adapter.javascript.0","user":"system.user.admin","lc":1700771421066}
    24.11.2023, 22:58:14.870	[info ]: javascript.0 (2838) script.js.NSPanel.Wohnzimmer: getState(id=0_userdata.0.NSPanel.1.ScreensaverInfo.popupNotifyHeading, timerId=undefined) => {"val":"","ack":true,"ts":1700771417200,"q":0,"c":"script.js.NSPanel.Wohnzimmer","from":"system.adapter.javascript.0","user":"system.user.admin","lc":1700771417200}
    24.11.2023, 22:58:14.870	[info ]: javascript.0 (2838) script.js.NSPanel.Wohnzimmer: getState(id=0_userdata.0.NSPanel.1.ScreensaverInfo.popupNotifyText, timerId=undefined) => {"val":"","ack":true,"ts":1700771418916,"q":0,"c":"script.js.NSPanel.Wohnzimmer","from":"system.adapter.javascript.0","user":"system.user.admin","lc":1700771418916}
    24.11.2023, 22:58:16.028	[info ]: javascript.0 (2838) script.js.NSPanel.Wohnzimmer: setForeignState(id=0_userdata.0.NSPanel.1.Sensor.Time, state={"val":"2023-11-24\r\n22:58:15","ack":true,"ts":1700863096028,"q":0,"from":"system.adapter.javascript.0","lc":1700863096028,"c":"script.js.NSPanel.Wohnzimmer"})
    24.11.2023, 22:58:16.034	[info ]: javascript.0 (2838) script.js.NSPanel.Wohnzimmer: setForeignState(id=0_userdata.0.NSPanel.1.Sensor.TempUnit, state={"val":"°C","ack":true,"ts":1700863096034,"q":0,"from":"system.adapter.javascript.0","lc":1700772292552,"c":"script.js.NSPanel.Wohnzimmer"})
    24.11.2023, 22:58:16.038	[info ]: javascript.0 (2838) script.js.NSPanel.Wohnzimmer: setForeignState(id=0_userdata.0.NSPanel.1.Sensor.ANALOG.Temperature, state={"val":-1.8,"ack":true,"ts":1700863096038,"q":0,"from":"system.adapter.javascript.0","lc":1700863096038,"c":"script.js.NSPanel.Wohnzimmer"})
    24.11.2023, 22:58:16.043	[info ]: javascript.0 (2838) script.js.NSPanel.Wohnzimmer: setForeignState(id=0_userdata.0.NSPanel.1.Sensor.ESP32.Temperature, state={"val":50.6,"ack":true,"ts":1700863096043,"q":0,"from":"system.adapter.javascript.0","lc":1700863096043,"c":"script.js.NSPanel.Wohnzimmer"})
    24.11.2023, 22:58:16.052	[info ]: javascript.0 (2838) script.js.NSPanel.Wohnzimmer: setObject(id=alias.0.NSPanel.1.Sensor.ANALOG.Temperature, obj={"type":"channel","common":{"role":"info","name":""},"native":{}})
    24.11.2023, 22:58:16.052	[info ]: javascript.0 (2838) script.js.NSPanel.Wohnzimmer: setObject(id=alias.0.NSPanel.1.Sensor.ESP32.Temperature, obj={"type":"channel","common":{"role":"info","name":""},"native":{}})
    24.11.2023, 22:58:16.052	[info ]: javascript.0 (2838) script.js.NSPanel.Wohnzimmer: setObject(id=alias.0.NSPanel.1.Sensor.Time, obj={"type":"channel","common":{"role":"info","name":""},"native":{}})
    24.11.2023, 22:58:16.052	[info ]: javascript.0 (2838) script.js.NSPanel.Wohnzimmer: setObject(id=alias.0.NSPanel.1.Sensor.TempUnit, obj={"type":"channel","common":{"role":"info","name":""},"native":{}})
    

    Ich hab auch eben nochmal das Wiki angesehen und alles neu geflasht. Keine Veränderung. Das einzige was noch merkwürdig ist, ist dass die Temperatur bei mir mit -2 °C angezeigt wird. Dann stand im Kommentar vom Script noch etwas mit einem Temperaturbefehl, den habe ich ebenfalls ausgeführt, dann zeigt er zusätzlich noch die ESP Temperatur mit ca. 50 °C an.

    ArmilarA Offline
    ArmilarA Offline
    Armilar
    Most Active Forum Testing
    schrieb am zuletzt editiert von Armilar
    #4349

    @theknut

    Sieh mal nach was in diesem Datenpunkt steht

    5156503d-bb1a-4267-a781-4a48f1733267-image.png

    und in denen
    1b63c6ef-95d1-4c1a-a414-c9089aa8f85e-image.png

    Der Temperatursensor muss kalibriert werden, wenn er genutzt werden soll. Ist per Tasmota grausig eingestellt ;-) . Ist allerdings auch nicht der genaueste (zieh dich warm an bei den Temperaturen :grinning: )
    https://github.com/joBr99/nspanel-lovelace-ui/wiki/NSPanel-Tasmota-FAQ#21--interner-raum-temperatursensor

    Ist übrigens alles korrekt, was da in Tasmota und im Script bei bExit passiert. So langsam wirds kompliziert.

    Nächster Versuch:
    0_userdata.0.NSPanel.1. und alias.0.NSPanel.1.
    noch mal löschen und vom Script wieder anlegen lassen

    Installationsanleitung, Tipps, Alias-Definitionen, FAQ für das Sonoff NSPanel mit lovelace UI unter ioBroker
    https://github.com/joBr99/nspanel-lovelace-ui/wiki

    Benutzt das Voting rechts unten im Beitrag wenn er euch geholfen hat.

    theknutT 1 Antwort Letzte Antwort
    1
    • ArmilarA Armilar

      @theknut

      Sieh mal nach was in diesem Datenpunkt steht

      5156503d-bb1a-4267-a781-4a48f1733267-image.png

      und in denen
      1b63c6ef-95d1-4c1a-a414-c9089aa8f85e-image.png

      Der Temperatursensor muss kalibriert werden, wenn er genutzt werden soll. Ist per Tasmota grausig eingestellt ;-) . Ist allerdings auch nicht der genaueste (zieh dich warm an bei den Temperaturen :grinning: )
      https://github.com/joBr99/nspanel-lovelace-ui/wiki/NSPanel-Tasmota-FAQ#21--interner-raum-temperatursensor

      Ist übrigens alles korrekt, was da in Tasmota und im Script bei bExit passiert. So langsam wirds kompliziert.

      Nächster Versuch:
      0_userdata.0.NSPanel.1. und alias.0.NSPanel.1.
      noch mal löschen und vom Script wieder anlegen lassen

      theknutT Offline
      theknutT Offline
      theknut
      schrieb am zuletzt editiert von theknut
      #4350

      @armilar Oah Wahnsinn, activeBrightness war bei mir auf null gestanden. Habe es dann ebenfalls auf 100 geändert und jetzt gehts 😍
      Wenn ich jetzt das Skript neustarte, dann bleibt die erste Seite ein paar Sekunden länger aktiv bis der Bildschirmschoner angeht. Sonst war der immer sofort da.

      Gib mal Paypal...

      ☕ @ https://ko-fi.com/theknut

      ArmilarA 1 Antwort Letzte Antwort
      1
      • theknutT theknut

        @armilar Oah Wahnsinn, activeBrightness war bei mir auf null gestanden. Habe es dann ebenfalls auf 100 geändert und jetzt gehts 😍
        Wenn ich jetzt das Skript neustarte, dann bleibt die erste Seite ein paar Sekunden länger aktiv bis der Bildschirmschoner angeht. Sonst war der immer sofort da.

        Gib mal Paypal...

        ArmilarA Offline
        ArmilarA Offline
        Armilar
        Most Active Forum Testing
        schrieb am zuletzt editiert von Armilar
        #4351

        @theknut

        Wüsste zu gerne, warum dieser Datenpunkt nicht gefüllt wurde... Bleibt wahrscheinlich ein Geheimnis... :face_with_rolling_eyes: Konnte zumindest während dieser Zeit parallel noch eine richtig coole Funktion entwickeln... :grin:

        Spoiler:
        Es ist eine "Always On Display" - Sache, die eine Seite z.B. die cardPower dauerhaft geöffnet hält und die Werte ohne die Seite zu rendern (also kein permanenter Neuaufbau der Seite) an die Seite übermittelt...
        Somit ist es möglich, z.B. den Energiefluss dauerhaft mit wechselnden Werten ohne zu flackern zu betrachten, ohne dass der Screensaver kommt.

        Mache da noch ein paar Tests und adaptiere die Funktion noch auf andere Seitentypen (z.B. cardMedia) --> Kommt dann mit der 4.3.3.12

        kleiner Mittschnitt:

        8bb53e20-4c7d-4a50-93ef-985aa70fac45-Nextion_Editor_9VQcYgHvBh.gif

        Installationsanleitung, Tipps, Alias-Definitionen, FAQ für das Sonoff NSPanel mit lovelace UI unter ioBroker
        https://github.com/joBr99/nspanel-lovelace-ui/wiki

        Benutzt das Voting rechts unten im Beitrag wenn er euch geholfen hat.

        1 Antwort Letzte Antwort
        2
        • jayjojaysonJ Offline
          jayjojaysonJ Offline
          jayjojayson
          schrieb am zuletzt editiert von
          #4352

          Hallo, ich habe ein Problem mit dem NS Panel Lovelace Ui Skript. Das Script für das Panel lief jetzt über ein Jahr problemlos. Nach einem Update des javascript controllers in iobroker hat er das Script auf einmal nicht mehr geladen. Als Fehler erhalte ich folgende Meldung im Debug:

          25.11.2023, 16:49:09.432	[info ]: javascript.0 (20022) script.js.NSPanels.Panel1: compiling TypeScript source...
          25.11.2023, 16:49:15.245	[error]: javascript.0 (20022) script.js.NSPanels.Panel1: TypeScript compilation failed:
                  if ((pageItem.useColor || useColors) && ((typeof (value) === 'boolean' && value) || value > (pageItem.minValueBrightness !== undefined ? pageItem.minValueBrightness : 0))) {
                                                                                                      ^
          ERROR: Operator '>' cannot be applied to types 'number | boolean' and 'number'.
          

          Könnt ihr mir bitte helfen, was muss ich tun um den Fehler zu beseitigen. Er scheint ein Problem mit number und boolean zu haben, aber ich weiß nicht wie man das korrigieren könnte. Ich habe am Script nichts geändert, nur den Abschnitt wo man die Kacheln des Displays konfigurieren kann. Ich würde mich freuen und bin für jede Hilfe dankbar.

          Grüße
          Jay

          GarganoG 1 Antwort Letzte Antwort
          0
          • jayjojaysonJ jayjojayson

            Hallo, ich habe ein Problem mit dem NS Panel Lovelace Ui Skript. Das Script für das Panel lief jetzt über ein Jahr problemlos. Nach einem Update des javascript controllers in iobroker hat er das Script auf einmal nicht mehr geladen. Als Fehler erhalte ich folgende Meldung im Debug:

            25.11.2023, 16:49:09.432	[info ]: javascript.0 (20022) script.js.NSPanels.Panel1: compiling TypeScript source...
            25.11.2023, 16:49:15.245	[error]: javascript.0 (20022) script.js.NSPanels.Panel1: TypeScript compilation failed:
                    if ((pageItem.useColor || useColors) && ((typeof (value) === 'boolean' && value) || value > (pageItem.minValueBrightness !== undefined ? pageItem.minValueBrightness : 0))) {
                                                                                                        ^
            ERROR: Operator '>' cannot be applied to types 'number | boolean' and 'number'.
            

            Könnt ihr mir bitte helfen, was muss ich tun um den Fehler zu beseitigen. Er scheint ein Problem mit number und boolean zu haben, aber ich weiß nicht wie man das korrigieren könnte. Ich habe am Script nichts geändert, nur den Abschnitt wo man die Kacheln des Displays konfigurieren kann. Ich würde mich freuen und bin für jede Hilfe dankbar.

            Grüße
            Jay

            GarganoG Offline
            GarganoG Offline
            Gargano
            schrieb am zuletzt editiert von
            #4353

            @jayjojayson Mein Lieblingsthema : Javascript Adapter wird immer restriktiver und was früher durchging, wirft jetzt einen Fehler. Bitte auf die neueste Version vom NSPanel mit Lovelace UI updaten.

            jayjojaysonJ 1 Antwort Letzte Antwort
            2
            • GarganoG Gargano

              @jayjojayson Mein Lieblingsthema : Javascript Adapter wird immer restriktiver und was früher durchging, wirft jetzt einen Fehler. Bitte auf die neueste Version vom NSPanel mit Lovelace UI updaten.

              jayjojaysonJ Offline
              jayjojaysonJ Offline
              jayjojayson
              schrieb am zuletzt editiert von
              #4354

              @gargano ok danke werde ich heute abend mal versuchen... habe auf jeden Fall noch eine der ersten Versionen..
              Ich hoffe ich bekomme das hin.

              ArmilarA 1 Antwort Letzte Antwort
              0
              • jayjojaysonJ jayjojayson

                @gargano ok danke werde ich heute abend mal versuchen... habe auf jeden Fall noch eine der ersten Versionen..
                Ich hoffe ich bekomme das hin.

                ArmilarA Offline
                ArmilarA Offline
                Armilar
                Most Active Forum Testing
                schrieb am zuletzt editiert von Armilar
                #4355

                @jayjojayson

                Hilfe gibt es genau hier...

                Ansonsten auch die Wiki befolgen. Es gab sehr viele Änderungen in den letzten 2 Jahren:

                https://github.com/joBr99/nspanel-lovelace-ui/wiki/ioBroker---Basisinstallation#step-für-step---anleitung

                Installationsanleitung, Tipps, Alias-Definitionen, FAQ für das Sonoff NSPanel mit lovelace UI unter ioBroker
                https://github.com/joBr99/nspanel-lovelace-ui/wiki

                Benutzt das Voting rechts unten im Beitrag wenn er euch geholfen hat.

                jayjojaysonJ 1 Antwort Letzte Antwort
                1
                • ArmilarA Armilar

                  @jayjojayson

                  Hilfe gibt es genau hier...

                  Ansonsten auch die Wiki befolgen. Es gab sehr viele Änderungen in den letzten 2 Jahren:

                  https://github.com/joBr99/nspanel-lovelace-ui/wiki/ioBroker---Basisinstallation#step-für-step---anleitung

                  jayjojaysonJ Offline
                  jayjojaysonJ Offline
                  jayjojayson
                  schrieb am zuletzt editiert von jayjojayson
                  #4356

                  @armilar @Gargano

                  Ich habe jetzt die Updates soweit vorgenommen. Der TFT Treiber und der Berry Treiber wurden auf die neuste Version gebracht. (edit: Tasmota ist weiterhin auf 12.2.0.)
                  Im Anschluss habe ich das neuste Script geladen/kopiert und als neues script im javascript modul angelegt. Die ersten grünen Zeilen aus dem script habe ich entsprechend beachtet und meine eigenen Seiten angepasst so dass sie gelesen werden können.

                  Jetzt funktioniert das Panel schon einmal wieder und ich kann meine Seiten auch bedienen. Trotzdem erhalte ich noch folgenden Fehler. Er findet irgendein Modul nicht. Unter dem javascript adapter habe ich aber moment und moment-parseformat eingestellt. Könnt ihr mir vielleicht sagen woran das liegt?

                  Screenshot 2023-11-25 192018.png

                  25.11.2023, 19:03:57.598	[info ]: javascript.0 (496) script.js.NSPanels.Panel2: compiling TypeScript source...
                  25.11.2023, 19:03:59.190	[info ]: javascript.0 (496) script.js.NSPanels.Panel2: source code did not change, using cached compilation result...
                  25.11.2023, 19:03:59.427	[error]: javascript.0 (496) script.js.NSPanels.Panel2: Error: Cannot find module 'dayjs'
                  25.11.2023, 19:03:59.429	[error]: javascript.0 (496)     at script.js.NSPanels.Panel2:951:13
                  25.11.2023, 19:03:59.432	[error]: javascript.0 (496) script.js.NSPanels.Panel2: Error: Cannot find module 'moment-parseformat'
                  25.11.2023, 19:03:59.433	[error]: javascript.0 (496)     at script.js.NSPanels.Panel2:953:19
                  25.11.2023, 19:03:59.439	[error]: javascript.0 (496) script.js.NSPanels.Panel2: Error: Cannot find module 'dayjs'
                  25.11.2023, 19:03:59.441	[error]: javascript.0 (496)     at script.js.NSPanels.Panel2:960:27
                  25.11.2023, 19:03:59.441	[error]: javascript.0 (496)     at step (script.js.NSPanels.Panel2:33:23)
                  25.11.2023, 19:03:59.441	[error]: javascript.0 (496)     at Object.next (script.js.NSPanels.Panel2:14:53)
                  25.11.2023, 19:03:59.442	[error]: javascript.0 (496)     at script.js.NSPanels.Panel2:8:71
                  25.11.2023, 19:03:59.442	[error]: javascript.0 (496)     at __awaiter (script.js.NSPanels.Panel2:4:12)
                  25.11.2023, 19:03:59.443	[error]: javascript.0 (496)     at Init_dayjs (script.js.NSPanels.Panel2:956:12)
                  25.11.2023, 19:03:59.443	[error]: javascript.0 (496)     at script.js.NSPanels.Panel2:977:1
                  25.11.2023, 19:03:59.445	[error]: javascript.0 (496) script.js.NSPanels.Panel2: Error: Cannot find module 'dayjs/locale/en'
                  25.11.2023, 19:03:59.447	[error]: javascript.0 (496)     at script.js.NSPanels.Panel2:966:21
                  25.11.2023, 19:03:59.447	[error]: javascript.0 (496)     at step (script.js.NSPanels.Panel2:33:23)
                  25.11.2023, 19:03:59.447	[error]: javascript.0 (496)     at Object.next (script.js.NSPanels.Panel2:14:53)
                  25.11.2023, 19:03:59.448	[error]: javascript.0 (496)     at script.js.NSPanels.Panel2:8:71
                  25.11.2023, 19:03:59.448	[error]: javascript.0 (496)     at __awaiter (script.js.NSPanels.Panel2:4:12)
                  25.11.2023, 19:03:59.448	[error]: javascript.0 (496)     at Init_dayjs (script.js.NSPanels.Panel2:956:12)
                  25.11.2023, 19:03:59.449	[error]: javascript.0 (496)     at script.js.NSPanels.Panel2:977:1
                  25.11.2023, 19:03:59.450	[error]: javascript.0 (496) script.js.NSPanels.Panel2: Error: Cannot find module 'dayjs/locale/de'
                  25.11.2023, 19:03:59.451	[error]: javascript.0 (496)     at script.js.NSPanels.Panel2:966:21
                  25.11.2023, 19:03:59.452	[error]: javascript.0 (496)     at step (script.js.NSPanels.Panel2:33:23)
                  25.11.2023, 19:03:59.452	[error]: javascript.0 (496)     at Object.next (script.js.NSPanels.Panel2:14:53)
                  25.11.2023, 19:03:59.452	[error]: javascript.0 (496)     at script.js.NSPanels.Panel2:8:71
                  25.11.2023, 19:03:59.453	[error]: javascript.0 (496)     at __awaiter (script.js.NSPanels.Panel2:4:12)
                  25.11.2023, 19:03:59.453	[error]: javascript.0 (496)     at Init_dayjs (script.js.NSPanels.Panel2:956:12)
                  25.11.2023, 19:03:59.453	[error]: javascript.0 (496)     at script.js.NSPanels.Panel2:977:1
                  25.11.2023, 19:03:59.455	[error]: javascript.0 (496) script.js.NSPanels.Panel2: Error: Cannot find module 'dayjs/locale/nl'
                  25.11.2023, 19:03:59.456	[error]: javascript.0 (496)     at script.js.NSPanels.Panel2:966:21
                  25.11.2023, 19:03:59.456	[error]: javascript.0 (496)     at step (script.js.NSPanels.Panel2:33:23)
                  25.11.2023, 19:03:59.456	[error]: javascript.0 (496)     at Object.next (script.js.NSPanels.Panel2:14:53)
                  25.11.2023, 19:03:59.457	[error]: javascript.0 (496)     at script.js.NSPanels.Panel2:8:71
                  25.11.2023, 19:03:59.457	[error]: javascript.0 (496)     at __awaiter (script.js.NSPanels.Panel2:4:12)
                  25.11.2023, 19:03:59.457	[error]: javascript.0 (496)     at Init_dayjs (script.js.NSPanels.Panel2:956:12)
                  25.11.2023, 19:03:59.458	[error]: javascript.0 (496)     at script.js.NSPanels.Panel2:977:1
                  25.11.2023, 19:03:59.459	[error]: javascript.0 (496) script.js.NSPanels.Panel2: Error: Cannot find module 'dayjs/locale/da'
                  25.11.2023, 19:03:59.460	[error]: javascript.0 (496)     at script.js.NSPanels.Panel2:966:21
                  25.11.2023, 19:03:59.461	[error]: javascript.0 (496)     at step (script.js.NSPanels.Panel2:33:23)
                  25.11.2023, 19:03:59.461	[error]: javascript.0 (496)     at Object.next (script.js.NSPanels.Panel2:14:53)
                  25.11.2023, 19:03:59.461	[error]: javascript.0 (496)     at script.js.NSPanels.Panel2:8:71
                  25.11.2023, 19:03:59.462	[error]: javascript.0 (496)     at __awaiter (script.js.NSPanels.Panel2:4:12)
                  25.11.2023, 19:03:59.462	[error]: javascript.0 (496)     at Init_dayjs (script.js.NSPanels.Panel2:956:12)
                  25.11.2023, 19:03:59.462	[error]: javascript.0 (496)     at script.js.NSPanels.Panel2:977:1
                  25.11.2023, 19:03:59.464	[error]: javascript.0 (496) script.js.NSPanels.Panel2: Error: Cannot find module 'dayjs/locale/es'
                  25.11.2023, 19:03:59.465	[error]: javascript.0 (496)     at script.js.NSPanels.Panel2:966:21
                  25.11.2023, 19:03:59.465	[error]: javascript.0 (496)     at step (script.js.NSPanels.Panel2:33:23)
                  25.11.2023, 19:03:59.465	[error]: javascript.0 (496)     at Object.next (script.js.NSPanels.Panel2:14:53)
                  25.11.2023, 19:03:59.466	[error]: javascript.0 (496)     at script.js.NSPanels.Panel2:8:71
                  25.11.2023, 19:03:59.466	[error]: javascript.0 (496)     at __awaiter (script.js.NSPanels.Panel2:4:12)
                  25.11.2023, 19:03:59.466	[error]: javascript.0 (496)     at Init_dayjs (script.js.NSPanels.Panel2:956:12)
                  25.11.2023, 19:03:59.466	[error]: javascript.0 (496)     at script.js.NSPanels.Panel2:977:1
                  25.11.2023, 19:03:59.468	[error]: javascript.0 (496) script.js.NSPanels.Panel2: Error: Cannot find module 'dayjs/locale/fr'
                  25.11.2023, 19:03:59.469	[error]: javascript.0 (496)     at script.js.NSPanels.Panel2:966:21
                  25.11.2023, 19:03:59.470	[error]: javascript.0 (496)     at step (script.js.NSPanels.Panel2:33:23)
                  25.11.2023, 19:03:59.470	[error]: javascript.0 (496)     at Object.next (script.js.NSPanels.Panel2:14:53)
                  25.11.2023, 19:03:59.470	[error]: javascript.0 (496)     at script.js.NSPanels.Panel2:8:71
                  25.11.2023, 19:03:59.470	[error]: javascript.0 (496)     at __awaiter (script.js.NSPanels.Panel2:4:12)
                  25.11.2023, 19:03:59.471	[error]: javascript.0 (496)     at Init_dayjs (script.js.NSPanels.Panel2:956:12)
                  25.11.2023, 19:03:59.471	[error]: javascript.0 (496)     at script.js.NSPanels.Panel2:977:1
                  25.11.2023, 19:03:59.473	[error]: javascript.0 (496) script.js.NSPanels.Panel2: Error: Cannot find module 'dayjs/locale/it'
                  25.11.2023, 19:03:59.474	[error]: javascript.0 (496)     at script.js.NSPanels.Panel2:966:21
                  25.11.2023, 19:03:59.474	[error]: javascript.0 (496)     at step (script.js.NSPanels.Panel2:33:23)
                  25.11.2023, 19:03:59.474	[error]: javascript.0 (496)     at Object.next (script.js.NSPanels.Panel2:14:53)
                  25.11.2023, 19:03:59.474	[error]: javascript.0 (496)     at script.js.NSPanels.Panel2:8:71
                  25.11.2023, 19:03:59.475	[error]: javascript.0 (496)     at __awaiter (script.js.NSPanels.Panel2:4:12)
                  25.11.2023, 19:03:59.475	[error]: javascript.0 (496)     at Init_dayjs (script.js.NSPanels.Panel2:956:12)
                  25.11.2023, 19:03:59.475	[error]: javascript.0 (496)     at script.js.NSPanels.Panel2:977:1
                  25.11.2023, 19:03:59.477	[error]: javascript.0 (496) script.js.NSPanels.Panel2: Error: Cannot find module 'dayjs/locale/ru'
                  25.11.2023, 19:03:59.478	[error]: javascript.0 (496)     at script.js.NSPanels.Panel2:966:21
                  25.11.2023, 19:03:59.479	[error]: javascript.0 (496)     at step (script.js.NSPanels.Panel2:33:23)
                  25.11.2023, 19:03:59.479	[error]: javascript.0 (496)     at Object.next (script.js.NSPanels.Panel2:14:53)
                  25.11.2023, 19:03:59.479	[error]: javascript.0 (496)     at script.js.NSPanels.Panel2:8:71
                  25.11.2023, 19:03:59.479	[error]: javascript.0 (496)     at __awaiter (script.js.NSPanels.Panel2:4:12)
                  25.11.2023, 19:03:59.480	[error]: javascript.0 (496)     at Init_dayjs (script.js.NSPanels.Panel2:956:12)
                  25.11.2023, 19:03:59.480	[error]: javascript.0 (496)     at script.js.NSPanels.Panel2:977:1
                  25.11.2023, 19:03:59.482	[error]: javascript.0 (496) script.js.NSPanels.Panel2: Error: Cannot find module 'dayjs/locale/nb'
                  25.11.2023, 19:03:59.483	[error]: javascript.0 (496)     at script.js.NSPanels.Panel2:966:21
                  25.11.2023, 19:03:59.483	[error]: javascript.0 (496)     at step (script.js.NSPanels.Panel2:33:23)
                  25.11.2023, 19:03:59.483	[error]: javascript.0 (496)     at Object.next (script.js.NSPanels.Panel2:14:53)
                  25.11.2023, 19:03:59.483	[error]: javascript.0 (496)     at script.js.NSPanels.Panel2:8:71
                  25.11.2023, 19:03:59.484	[error]: javascript.0 (496)     at __awaiter (script.js.NSPanels.Panel2:4:12)
                  25.11.2023, 19:03:59.484	[error]: javascript.0 (496)     at Init_dayjs (script.js.NSPanels.Panel2:956:12)
                  25.11.2023, 19:03:59.484	[error]: javascript.0 (496)     at script.js.NSPanels.Panel2:977:1
                  25.11.2023, 19:03:59.486	[error]: javascript.0 (496) script.js.NSPanels.Panel2: Error: Cannot find module 'dayjs/locale/nn'
                  25.11.2023, 19:03:59.487	[error]: javascript.0 (496)     at script.js.NSPanels.Panel2:966:21
                  25.11.2023, 19:03:59.487	[error]: javascript.0 (496)     at step (script.js.NSPanels.Panel2:33:23)
                  25.11.2023, 19:03:59.488	[error]: javascript.0 (496)     at Object.next (script.js.NSPanels.Panel2:14:53)
                  25.11.2023, 19:03:59.488	[error]: javascript.0 (496)     at script.js.NSPanels.Panel2:8:71
                  25.11.2023, 19:03:59.488	[error]: javascript.0 (496)     at __awaiter (script.js.NSPanels.Panel2:4:12)
                  25.11.2023, 19:03:59.488	[error]: javascript.0 (496)     at Init_dayjs (script.js.NSPanels.Panel2:956:12)
                  25.11.2023, 19:03:59.489	[error]: javascript.0 (496)     at script.js.NSPanels.Panel2:977:1
                  25.11.2023, 19:03:59.491	[error]: javascript.0 (496) script.js.NSPanels.Panel2: Error: Cannot find module 'dayjs/locale/pl'
                  25.11.2023, 19:03:59.492	[error]: javascript.0 (496)     at script.js.NSPanels.Panel2:966:21
                  25.11.2023, 19:03:59.492	[error]: javascript.0 (496)     at step (script.js.NSPanels.Panel2:33:23)
                  25.11.2023, 19:03:59.492	[error]: javascript.0 (496)     at Object.next (script.js.NSPanels.Panel2:14:53)
                  25.11.2023, 19:03:59.492	[error]: javascript.0 (496)     at script.js.NSPanels.Panel2:8:71
                  25.11.2023, 19:03:59.493	[error]: javascript.0 (496)     at __awaiter (script.js.NSPanels.Panel2:4:12)
                  25.11.2023, 19:03:59.493	[error]: javascript.0 (496)     at Init_dayjs (script.js.NSPanels.Panel2:956:12)
                  25.11.2023, 19:03:59.493	[error]: javascript.0 (496)     at script.js.NSPanels.Panel2:977:1
                  25.11.2023, 19:03:59.495	[error]: javascript.0 (496) script.js.NSPanels.Panel2: Error: Cannot find module 'dayjs/locale/pt'
                  25.11.2023, 19:03:59.496	[error]: javascript.0 (496)     at script.js.NSPanels.Panel2:966:21
                  25.11.2023, 19:03:59.496	[error]: javascript.0 (496)     at step (script.js.NSPanels.Panel2:33:23)
                  25.11.2023, 19:03:59.496	[error]: javascript.0 (496)     at Object.next (script.js.NSPanels.Panel2:14:53)
                  25.11.2023, 19:03:59.497	[error]: javascript.0 (496)     at script.js.NSPanels.Panel2:8:71
                  25.11.2023, 19:03:59.497	[error]: javascript.0 (496)     at __awaiter (script.js.NSPanels.Panel2:4:12)
                  25.11.2023, 19:03:59.497	[error]: javascript.0 (496)     at Init_dayjs (script.js.NSPanels.Panel2:956:12)
                  25.11.2023, 19:03:59.498	[error]: javascript.0 (496)     at script.js.NSPanels.Panel2:977:1
                  25.11.2023, 19:03:59.499	[error]: javascript.0 (496) script.js.NSPanels.Panel2: Error: Cannot find module 'dayjs/locale/af'
                  25.11.2023, 19:03:59.501	[error]: javascript.0 (496)     at script.js.NSPanels.Panel2:966:21
                  25.11.2023, 19:03:59.501	[error]: javascript.0 (496)     at step (script.js.NSPanels.Panel2:33:23)
                  25.11.2023, 19:03:59.501	[error]: javascript.0 (496)     at Object.next (script.js.NSPanels.Panel2:14:53)
                  25.11.2023, 19:03:59.501	[error]: javascript.0 (496)     at script.js.NSPanels.Panel2:8:71
                  25.11.2023, 19:03:59.502	[error]: javascript.0 (496)     at __awaiter (script.js.NSPanels.Panel2:4:12)
                  25.11.2023, 19:03:59.502	[error]: javascript.0 (496)     at Init_dayjs (script.js.NSPanels.Panel2:956:12)
                  25.11.2023, 19:03:59.502	[error]: javascript.0 (496)     at script.js.NSPanels.Panel2:977:1
                  25.11.2023, 19:03:59.510	[error]: javascript.0 (496) script.js.NSPanels.Panel2: Error: Cannot find module 'dayjs/locale/ar'
                  25.11.2023, 19:03:59.512	[error]: javascript.0 (496)     at script.js.NSPanels.Panel2:966:21
                  25.11.2023, 19:03:59.512	[error]: javascript.0 (496)     at step (script.js.NSPanels.Panel2:33:23)
                  25.11.2023, 19:03:59.512	[error]: javascript.0 (496)     at Object.next (script.js.NSPanels.Panel2:14:53)
                  25.11.2023, 19:03:59.513	[error]: javascript.0 (496)     at script.js.NSPanels.Panel2:8:71
                  25.11.2023, 19:03:59.513	[error]: javascript.0 (496)     at __awaiter (script.js.NSPanels.Panel2:4:12)
                  25.11.2023, 19:03:59.513	[error]: javascript.0 (496)     at Init_dayjs (script.js.NSPanels.Panel2:956:12)
                  25.11.2023, 19:03:59.514	[error]: javascript.0 (496)     at script.js.NSPanels.Panel2:977:1
                  25.11.2023, 19:03:59.515	[error]: javascript.0 (496) script.js.NSPanels.Panel2: Error: Cannot find module 'dayjs/locale/bg'
                  25.11.2023, 19:03:59.516	[error]: javascript.0 (496)     at script.js.NSPanels.Panel2:966:21
                  25.11.2023, 19:03:59.517	[error]: javascript.0 (496)     at step (script.js.NSPanels.Panel2:33:23)
                  25.11.2023, 19:03:59.517	[error]: javascript.0 (496)     at Object.next (script.js.NSPanels.Panel2:14:53)
                  25.11.2023, 19:03:59.517	[error]: javascript.0 (496)     at script.js.NSPanels.Panel2:8:71
                  25.11.2023, 19:03:59.517	[error]: javascript.0 (496)     at __awaiter (script.js.NSPanels.Panel2:4:12)
                  25.11.2023, 19:03:59.518	[error]: javascript.0 (496)     at Init_dayjs (script.js.NSPanels.Panel2:956:12)
                  25.11.2023, 19:03:59.518	[error]: javascript.0 (496)     at script.js.NSPanels.Panel2:977:1
                  25.11.2023, 19:03:59.520	[error]: javascript.0 (496) script.js.NSPanels.Panel2: Error: Cannot find module 'dayjs/locale/ca'
                  25.11.2023, 19:03:59.521	[error]: javascript.0 (496)     at script.js.NSPanels.Panel2:966:21
                  25.11.2023, 19:03:59.521	[error]: javascript.0 (496)     at step (script.js.NSPanels.Panel2:33:23)
                  25.11.2023, 19:03:59.521	[error]: javascript.0 (496)     at Object.next (script.js.NSPanels.Panel2:14:53)
                  25.11.2023, 19:03:59.521	[error]: javascript.0 (496)     at script.js.NSPanels.Panel2:8:71
                  25.11.2023, 19:03:59.522	[error]: javascript.0 (496)     at __awaiter (script.js.NSPanels.Panel2:4:12)
                  25.11.2023, 19:03:59.522	[error]: javascript.0 (496)     at Init_dayjs (script.js.NSPanels.Panel2:956:12)
                  25.11.2023, 19:03:59.522	[error]: javascript.0 (496)     at script.js.NSPanels.Panel2:977:1
                  25.11.2023, 19:03:59.524	[error]: javascript.0 (496) script.js.NSPanels.Panel2: Error: Cannot find module 'dayjs/locale/cs'
                  25.11.2023, 19:03:59.525	[error]: javascript.0 (496)     at script.js.NSPanels.Panel2:966:21
                  25.11.2023, 19:03:59.525	[error]: javascript.0 (496)     at step (script.js.NSPanels.Panel2:33:23)
                  25.11.2023, 19:03:59.525	[error]: javascript.0 (496)     at Object.next (script.js.NSPanels.Panel2:14:53)
                  25.11.2023, 19:03:59.525	[error]: javascript.0 (496)     at script.js.NSPanels.Panel2:8:71
                  25.11.2023, 19:03:59.526	[error]: javascript.0 (496)     at __awaiter (script.js.NSPanels.Panel2:4:12)
                  25.11.2023, 19:03:59.526	[error]: javascript.0 (496)     at Init_dayjs (script.js.NSPanels.Panel2:956:12)
                  25.11.2023, 19:03:59.526	[error]: javascript.0 (496)     at script.js.NSPanels.Panel2:977:1
                  25.11.2023, 19:03:59.528	[error]: javascript.0 (496) script.js.NSPanels.Panel2: Error: Cannot find module 'dayjs/locale/el'
                  25.11.2023, 19:03:59.529	[error]: javascript.0 (496)     at script.js.NSPanels.Panel2:966:21
                  25.11.2023, 19:03:59.529	[error]: javascript.0 (496)     at step (script.js.NSPanels.Panel2:33:23)
                  25.11.2023, 19:03:59.529	[error]: javascript.0 (496)     at Object.next (script.js.NSPanels.Panel2:14:53)
                  25.11.2023, 19:03:59.529	[error]: javascript.0 (496)     at script.js.NSPanels.Panel2:8:71
                  25.11.2023, 19:03:59.530	[error]: javascript.0 (496)     at __awaiter (script.js.NSPanels.Panel2:4:12)
                  25.11.2023, 19:03:59.530	[error]: javascript.0 (496)     at Init_dayjs (script.js.NSPanels.Panel2:956:12)
                  25.11.2023, 19:03:59.530	[error]: javascript.0 (496)     at script.js.NSPanels.Panel2:977:1
                  25.11.2023, 19:03:59.532	[error]: javascript.0 (496) script.js.NSPanels.Panel2: Error: Cannot find module 'dayjs/locale/et'
                  25.11.2023, 19:03:59.535	[error]: javascript.0 (496)     at script.js.NSPanels.Panel2:966:21
                  25.11.2023, 19:03:59.535	[error]: javascript.0 (496)     at step (script.js.NSPanels.Panel2:33:23)
                  25.11.2023, 19:03:59.535	[error]: javascript.0 (496)     at Object.next (script.js.NSPanels.Panel2:14:53)
                  25.11.2023, 19:03:59.535	[error]: javascript.0 (496)     at script.js.NSPanels.Panel2:8:71
                  25.11.2023, 19:03:59.536	[error]: javascript.0 (496)     at __awaiter (script.js.NSPanels.Panel2:4:12)
                  25.11.2023, 19:03:59.536	[error]: javascript.0 (496)     at Init_dayjs (script.js.NSPanels.Panel2:956:12)
                  25.11.2023, 19:03:59.536	[error]: javascript.0 (496)     at script.js.NSPanels.Panel2:977:1
                  25.11.2023, 19:03:59.538	[error]: javascript.0 (496) script.js.NSPanels.Panel2: Error: Cannot find module 'dayjs/locale/fa'
                  25.11.2023, 19:03:59.539	[error]: javascript.0 (496)     at script.js.NSPanels.Panel2:966:21
                  25.11.2023, 19:03:59.540	[error]: javascript.0 (496)     at step (script.js.NSPanels.Panel2:33:23)
                  25.11.2023, 19:03:59.540	[error]: javascript.0 (496)     at Object.next (script.js.NSPanels.Panel2:14:53)
                  25.11.2023, 19:03:59.540	[error]: javascript.0 (496)     at script.js.NSPanels.Panel2:8:71
                  25.11.2023, 19:03:59.540	[error]: javascript.0 (496)     at __awaiter (script.js.NSPanels.Panel2:4:12)
                  25.11.2023, 19:03:59.540	[error]: javascript.0 (496)     at Init_dayjs (script.js.NSPanels.Panel2:956:12)
                  25.11.2023, 19:03:59.541	[error]: javascript.0 (496)     at script.js.NSPanels.Panel2:977:1
                  25.11.2023, 19:03:59.550	[error]: javascript.0 (496) script.js.NSPanels.Panel2: Error: Cannot find module 'dayjs/locale/fi'
                  25.11.2023, 19:03:59.551	[error]: javascript.0 (496)     at script.js.NSPanels.Panel2:966:21
                  25.11.2023, 19:03:59.551	[error]: javascript.0 (496)     at step (script.js.NSPanels.Panel2:33:23)
                  25.11.2023, 19:03:59.552	[error]: javascript.0 (496)     at Object.next (script.js.NSPanels.Panel2:14:53)
                  25.11.2023, 19:03:59.552	[error]: javascript.0 (496)     at script.js.NSPanels.Panel2:8:71
                  25.11.2023, 19:03:59.552	[error]: javascript.0 (496)     at __awaiter (script.js.NSPanels.Panel2:4:12)
                  25.11.2023, 19:03:59.552	[error]: javascript.0 (496)     at Init_dayjs (script.js.NSPanels.Panel2:956:12)
                  25.11.2023, 19:03:59.553	[error]: javascript.0 (496)     at script.js.NSPanels.Panel2:977:1
                  25.11.2023, 19:03:59.554	[error]: javascript.0 (496) script.js.NSPanels.Panel2: Error: Cannot find module 'dayjs/locale/he'
                  25.11.2023, 19:03:59.555	[error]: javascript.0 (496)     at script.js.NSPanels.Panel2:966:21
                  25.11.2023, 19:03:59.555	[error]: javascript.0 (496)     at step (script.js.NSPanels.Panel2:33:23)
                  25.11.2023, 19:03:59.556	[error]: javascript.0 (496)     at Object.next (script.js.NSPanels.Panel2:14:53)
                  25.11.2023, 19:03:59.556	[error]: javascript.0 (496)     at script.js.NSPanels.Panel2:8:71
                  25.11.2023, 19:03:59.556	[error]: javascript.0 (496)     at __awaiter (script.js.NSPanels.Panel2:4:12)
                  25.11.2023, 19:03:59.556	[error]: javascript.0 (496)     at Init_dayjs (script.js.NSPanels.Panel2:956:12)
                  25.11.2023, 19:03:59.556	[error]: javascript.0 (496)     at script.js.NSPanels.Panel2:977:1
                  25.11.2023, 19:03:59.558	[error]: javascript.0 (496) script.js.NSPanels.Panel2: Error: Cannot find module 'dayjs/locale/hr'
                  25.11.2023, 19:03:59.559	[error]: javascript.0 (496)     at script.js.NSPanels.Panel2:966:21
                  25.11.2023, 19:03:59.559	[error]: javascript.0 (496)     at step (script.js.NSPanels.Panel2:33:23)
                  25.11.2023, 19:03:59.560	[error]: javascript.0 (496)     at Object.next (script.js.NSPanels.Panel2:14:53)
                  25.11.2023, 19:03:59.560	[error]: javascript.0 (496)     at script.js.NSPanels.Panel2:8:71
                  25.11.2023, 19:03:59.560	[error]: javascript.0 (496)     at __awaiter (script.js.NSPanels.Panel2:4:12)
                  25.11.2023, 19:03:59.560	[error]: javascript.0 (496)     at Init_dayjs (script.js.NSPanels.Panel2:956:12)
                  25.11.2023, 19:03:59.560	[error]: javascript.0 (496)     at script.js.NSPanels.Panel2:977:1
                  25.11.2023, 19:03:59.562	[error]: javascript.0 (496) script.js.NSPanels.Panel2: Error: Cannot find module 'dayjs/locale/hu'
                  25.11.2023, 19:03:59.563	[error]: javascript.0 (496)     at script.js.NSPanels.Panel2:966:21
                  25.11.2023, 19:03:59.563	[error]: javascript.0 (496)     at step (script.js.NSPanels.Panel2:33:23)
                  25.11.2023, 19:03:59.563	[error]: javascript.0 (496)     at Object.next (script.js.NSPanels.Panel2:14:53)
                  25.11.2023, 19:03:59.564	[error]: javascript.0 (496)     at script.js.NSPanels.Panel2:8:71
                  25.11.2023, 19:03:59.564	[error]: javascript.0 (496)     at __awaiter (script.js.NSPanels.Panel2:4:12)
                  25.11.2023, 19:03:59.564	[error]: javascript.0 (496)     at Init_dayjs (script.js.NSPanels.Panel2:956:12)
                  25.11.2023, 19:03:59.565	[error]: javascript.0 (496)     at script.js.NSPanels.Panel2:977:1
                  25.11.2023, 19:03:59.568	[error]: javascript.0 (496) script.js.NSPanels.Panel2: Error: Cannot find module 'dayjs/locale/hy-am'
                  25.11.2023, 19:03:59.569	[error]: javascript.0 (496)     at script.js.NSPanels.Panel2:966:21
                  25.11.2023, 19:03:59.570	[error]: javascript.0 (496)     at step (script.js.NSPanels.Panel2:33:23)
                  25.11.2023, 19:03:59.570	[error]: javascript.0 (496)     at Object.next (script.js.NSPanels.Panel2:14:53)
                  25.11.2023, 19:03:59.570	[error]: javascript.0 (496)     at script.js.NSPanels.Panel2:8:71
                  25.11.2023, 19:03:59.571	[error]: javascript.0 (496)     at __awaiter (script.js.NSPanels.Panel2:4:12)
                  25.11.2023, 19:03:59.571	[error]: javascript.0 (496)     at Init_dayjs (script.js.NSPanels.Panel2:956:12)
                  25.11.2023, 19:03:59.571	[error]: javascript.0 (496)     at script.js.NSPanels.Panel2:977:1
                  25.11.2023, 19:03:59.573	[error]: javascript.0 (496) script.js.NSPanels.Panel2: Error: Cannot find module 'dayjs/locale/id'
                  25.11.2023, 19:03:59.574	[error]: javascript.0 (496)     at script.js.NSPanels.Panel2:966:21
                  25.11.2023, 19:03:59.574	[error]: javascript.0 (496)     at step (script.js.NSPanels.Panel2:33:23)
                  25.11.2023, 19:03:59.574	[error]: javascript.0 (496)     at Object.next (script.js.NSPanels.Panel2:14:53)
                  25.11.2023, 19:03:59.574	[error]: javascript.0 (496)     at script.js.NSPanels.Panel2:8:71
                  25.11.2023, 19:03:59.574	[error]: javascript.0 (496)     at __awaiter (script.js.NSPanels.Panel2:4:12)
                  25.11.2023, 19:03:59.575	[error]: javascript.0 (496)     at Init_dayjs (script.js.NSPanels.Panel2:956:12)
                  25.11.2023, 19:03:59.575	[error]: javascript.0 (496)     at script.js.NSPanels.Panel2:977:1
                  25.11.2023, 19:03:59.577	[error]: javascript.0 (496) script.js.NSPanels.Panel2: Error: Cannot find module 'dayjs/locale/is'
                  25.11.2023, 19:03:59.578	[error]: javascript.0 (496)     at script.js.NSPanels.Panel2:966:21
                  25.11.2023, 19:03:59.578	[error]: javascript.0 (496)     at step (script.js.NSPanels.Panel2:33:23)
                  25.11.2023, 19:03:59.578	[error]: javascript.0 (496)     at Object.next (script.js.NSPanels.Panel2:14:53)
                  25.11.2023, 19:03:59.579	[error]: javascript.0 (496)     at script.js.NSPanels.Panel2:8:71
                  25.11.2023, 19:03:59.579	[error]: javascript.0 (496)     at __awaiter (script.js.NSPanels.Panel2:4:12)
                  25.11.2023, 19:03:59.579	[error]: javascript.0 (496)     at Init_dayjs (script.js.NSPanels.Panel2:956:12)
                  25.11.2023, 19:03:59.579	[error]: javascript.0 (496)     at script.js.NSPanels.Panel2:977:1
                  25.11.2023, 19:03:59.581	[error]: javascript.0 (496) script.js.NSPanels.Panel2: Error: Cannot find module 'dayjs/locale/lb'
                  25.11.2023, 19:03:59.582	[error]: javascript.0 (496)     at script.js.NSPanels.Panel2:966:21
                  25.11.2023, 19:03:59.582	[error]: javascript.0 (496)     at step (script.js.NSPanels.Panel2:33:23)
                  25.11.2023, 19:03:59.582	[error]: javascript.0 (496)     at Object.next (script.js.NSPanels.Panel2:14:53)
                  25.11.2023, 19:03:59.583	[error]: javascript.0 (496)     at script.js.NSPanels.Panel2:8:71
                  25.11.2023, 19:03:59.583	[error]: javascript.0 (496)     at __awaiter (script.js.NSPanels.Panel2:4:12)
                  25.11.2023, 19:03:59.583	[error]: javascript.0 (496)     at Init_dayjs (script.js.NSPanels.Panel2:956:12)
                  25.11.2023, 19:03:59.583	[error]: javascript.0 (496)     at script.js.NSPanels.Panel2:977:1
                  25.11.2023, 19:03:59.585	[error]: javascript.0 (496) script.js.NSPanels.Panel2: Error: Cannot find module 'dayjs/locale/lt'
                  25.11.2023, 19:03:59.586	[error]: javascript.0 (496)     at script.js.NSPanels.Panel2:966:21
                  25.11.2023, 19:03:59.586	[error]: javascript.0 (496)     at step (script.js.NSPanels.Panel2:33:23)
                  25.11.2023, 19:03:59.586	[error]: javascript.0 (496)     at Object.next (script.js.NSPanels.Panel2:14:53)
                  25.11.2023, 19:03:59.586	[error]: javascript.0 (496)     at script.js.NSPanels.Panel2:8:71
                  25.11.2023, 19:03:59.587	[error]: javascript.0 (496)     at __awaiter (script.js.NSPanels.Panel2:4:12)
                  25.11.2023, 19:03:59.587	[error]: javascript.0 (496)     at Init_dayjs (script.js.NSPanels.Panel2:956:12)
                  25.11.2023, 19:03:59.587	[error]: javascript.0 (496)     at script.js.NSPanels.Panel2:977:1
                  25.11.2023, 19:03:59.589	[error]: javascript.0 (496) script.js.NSPanels.Panel2: Error: Cannot find module 'dayjs/locale/ro'
                  25.11.2023, 19:03:59.590	[error]: javascript.0 (496)     at script.js.NSPanels.Panel2:966:21
                  25.11.2023, 19:03:59.590	[error]: javascript.0 (496)     at step (script.js.NSPanels.Panel2:33:23)
                  25.11.2023, 19:03:59.590	[error]: javascript.0 (496)     at Object.next (script.js.NSPanels.Panel2:14:53)
                  25.11.2023, 19:03:59.591	[error]: javascript.0 (496)     at script.js.NSPanels.Panel2:8:71
                  25.11.2023, 19:03:59.591	[error]: javascript.0 (496)     at __awaiter (script.js.NSPanels.Panel2:4:12)
                  25.11.2023, 19:03:59.591	[error]: javascript.0 (496)     at Init_dayjs (script.js.NSPanels.Panel2:956:12)
                  25.11.2023, 19:03:59.592	[error]: javascript.0 (496)     at script.js.NSPanels.Panel2:977:1
                  25.11.2023, 19:03:59.593	[error]: javascript.0 (496) script.js.NSPanels.Panel2: Error: Cannot find module 'dayjs/locale/sk'
                  25.11.2023, 19:03:59.595	[error]: javascript.0 (496)     at script.js.NSPanels.Panel2:966:21
                  25.11.2023, 19:03:59.595	[error]: javascript.0 (496)     at step (script.js.NSPanels.Panel2:33:23)
                  25.11.2023, 19:03:59.595	[error]: javascript.0 (496)     at Object.next (script.js.NSPanels.Panel2:14:53)
                  25.11.2023, 19:03:59.596	[error]: javascript.0 (496)     at script.js.NSPanels.Panel2:8:71
                  25.11.2023, 19:03:59.596	[error]: javascript.0 (496)     at __awaiter (script.js.NSPanels.Panel2:4:12)
                  25.11.2023, 19:03:59.596	[error]: javascript.0 (496)     at Init_dayjs (script.js.NSPanels.Panel2:956:12)
                  25.11.2023, 19:03:59.596	[error]: javascript.0 (496)     at script.js.NSPanels.Panel2:977:1
                  25.11.2023, 19:03:59.598	[error]: javascript.0 (496) script.js.NSPanels.Panel2: Error: Cannot find module 'dayjs/locale/sl'
                  25.11.2023, 19:03:59.599	[error]: javascript.0 (496)     at script.js.NSPanels.Panel2:966:21
                  25.11.2023, 19:03:59.599	[error]: javascript.0 (496)     at step (script.js.NSPanels.Panel2:33:23)
                  25.11.2023, 19:03:59.599	[error]: javascript.0 (496)     at Object.next (script.js.NSPanels.Panel2:14:53)
                  25.11.2023, 19:03:59.600	[error]: javascript.0 (496)     at script.js.NSPanels.Panel2:8:71
                  25.11.2023, 19:03:59.600	[error]: javascript.0 (496)     at __awaiter (script.js.NSPanels.Panel2:4:12)
                  25.11.2023, 19:03:59.600	[error]: javascript.0 (496)     at Init_dayjs (script.js.NSPanels.Panel2:956:12)
                  25.11.2023, 19:03:59.600	[error]: javascript.0 (496)     at script.js.NSPanels.Panel2:977:1
                  25.11.2023, 19:03:59.602	[error]: javascript.0 (496) script.js.NSPanels.Panel2: Error: Cannot find module 'dayjs/locale/sv'
                  25.11.2023, 19:03:59.603	[error]: javascript.0 (496)     at script.js.NSPanels.Panel2:966:21
                  25.11.2023, 19:03:59.603	[error]: javascript.0 (496)     at step (script.js.NSPanels.Panel2:33:23)
                  25.11.2023, 19:03:59.603	[error]: javascript.0 (496)     at Object.next (script.js.NSPanels.Panel2:14:53)
                  25.11.2023, 19:03:59.603	[error]: javascript.0 (496)     at script.js.NSPanels.Panel2:8:71
                  25.11.2023, 19:03:59.604	[error]: javascript.0 (496)     at __awaiter (script.js.NSPanels.Panel2:4:12)
                  25.11.2023, 19:03:59.604	[error]: javascript.0 (496)     at Init_dayjs (script.js.NSPanels.Panel2:956:12)
                  25.11.2023, 19:03:59.604	[error]: javascript.0 (496)     at script.js.NSPanels.Panel2:977:1
                  25.11.2023, 19:03:59.606	[error]: javascript.0 (496) script.js.NSPanels.Panel2: Error: Cannot find module 'dayjs/locale/th'
                  25.11.2023, 19:03:59.607	[error]: javascript.0 (496)     at script.js.NSPanels.Panel2:966:21
                  25.11.2023, 19:03:59.607	[error]: javascript.0 (496)     at step (script.js.NSPanels.Panel2:33:23)
                  25.11.2023, 19:03:59.607	[error]: javascript.0 (496)     at Object.next (script.js.NSPanels.Panel2:14:53)
                  25.11.2023, 19:03:59.609	[error]: javascript.0 (496)     at script.js.NSPanels.Panel2:8:71
                  25.11.2023, 19:03:59.609	[error]: javascript.0 (496)     at __awaiter (script.js.NSPanels.Panel2:4:12)
                  25.11.2023, 19:03:59.610	[error]: javascript.0 (496)     at Init_dayjs (script.js.NSPanels.Panel2:956:12)
                  25.11.2023, 19:03:59.610	[error]: javascript.0 (496)     at script.js.NSPanels.Panel2:977:1
                  25.11.2023, 19:03:59.612	[error]: javascript.0 (496) script.js.NSPanels.Panel2: Error: Cannot find module 'dayjs/locale/tr'
                  25.11.2023, 19:03:59.613	[error]: javascript.0 (496)     at script.js.NSPanels.Panel2:966:21
                  25.11.2023, 19:03:59.613	[error]: javascript.0 (496)     at step (script.js.NSPanels.Panel2:33:23)
                  25.11.2023, 19:03:59.614	[error]: javascript.0 (496)     at Object.next (script.js.NSPanels.Panel2:14:53)
                  25.11.2023, 19:03:59.614	[error]: javascript.0 (496)     at script.js.NSPanels.Panel2:8:71
                  25.11.2023, 19:03:59.615	[error]: javascript.0 (496)     at __awaiter (script.js.NSPanels.Panel2:4:12)
                  25.11.2023, 19:03:59.615	[error]: javascript.0 (496)     at Init_dayjs (script.js.NSPanels.Panel2:956:12)
                  25.11.2023, 19:03:59.615	[error]: javascript.0 (496)     at script.js.NSPanels.Panel2:977:1
                  25.11.2023, 19:03:59.618	[error]: javascript.0 (496) script.js.NSPanels.Panel2: Error: Cannot find module 'dayjs/locale/uk'
                  25.11.2023, 19:03:59.619	[error]: javascript.0 (496)     at script.js.NSPanels.Panel2:966:21
                  25.11.2023, 19:03:59.619	[error]: javascript.0 (496)     at step (script.js.NSPanels.Panel2:33:23)
                  25.11.2023, 19:03:59.619	[error]: javascript.0 (496)     at Object.next (script.js.NSPanels.Panel2:14:53)
                  25.11.2023, 19:03:59.619	[error]: javascript.0 (496)     at script.js.NSPanels.Panel2:8:71
                  25.11.2023, 19:03:59.620	[error]: javascript.0 (496)     at __awaiter (script.js.NSPanels.Panel2:4:12)
                  25.11.2023, 19:03:59.620	[error]: javascript.0 (496)     at Init_dayjs (script.js.NSPanels.Panel2:956:12)
                  25.11.2023, 19:03:59.620	[error]: javascript.0 (496)     at script.js.NSPanels.Panel2:977:1
                  25.11.2023, 19:03:59.622	[error]: javascript.0 (496) script.js.NSPanels.Panel2: Error: Cannot find module 'dayjs/locale/vi'
                  25.11.2023, 19:03:59.622	[error]: javascript.0 (496)     at script.js.NSPanels.Panel2:966:21
                  25.11.2023, 19:03:59.623	[error]: javascript.0 (496)     at step (script.js.NSPanels.Panel2:33:23)
                  25.11.2023, 19:03:59.623	[error]: javascript.0 (496)     at Object.next (script.js.NSPanels.Panel2:14:53)
                  25.11.2023, 19:03:59.623	[error]: javascript.0 (496)     at script.js.NSPanels.Panel2:8:71
                  25.11.2023, 19:03:59.623	[error]: javascript.0 (496)     at __awaiter (script.js.NSPanels.Panel2:4:12)
                  25.11.2023, 19:03:59.623	[error]: javascript.0 (496)     at Init_dayjs (script.js.NSPanels.Panel2:956:12)
                  25.11.2023, 19:03:59.624	[error]: javascript.0 (496)     at script.js.NSPanels.Panel2:977:1
                  25.11.2023, 19:03:59.625	[error]: javascript.0 (496) script.js.NSPanels.Panel2: Error: Cannot find module 'dayjs/locale/zh-cn'
                  25.11.2023, 19:03:59.626	[error]: javascript.0 (496)     at script.js.NSPanels.Panel2:966:21
                  25.11.2023, 19:03:59.626	[error]: javascript.0 (496)     at step (script.js.NSPanels.Panel2:33:23)
                  25.11.2023, 19:03:59.626	[error]: javascript.0 (496)     at Object.next (script.js.NSPanels.Panel2:14:53)
                  25.11.2023, 19:03:59.626	[error]: javascript.0 (496)     at script.js.NSPanels.Panel2:8:71
                  25.11.2023, 19:03:59.627	[error]: javascript.0 (496)     at __awaiter (script.js.NSPanels.Panel2:4:12)
                  25.11.2023, 19:03:59.627	[error]: javascript.0 (496)     at Init_dayjs (script.js.NSPanels.Panel2:956:12)
                  25.11.2023, 19:03:59.627	[error]: javascript.0 (496)     at script.js.NSPanels.Panel2:977:1
                  25.11.2023, 19:03:59.629	[error]: javascript.0 (496) script.js.NSPanels.Panel2: Error: Cannot find module 'dayjs/locale/zh-tw'
                  25.11.2023, 19:03:59.630	[error]: javascript.0 (496)     at script.js.NSPanels.Panel2:966:21
                  25.11.2023, 19:03:59.630	[error]: javascript.0 (496)     at step (script.js.NSPanels.Panel2:33:23)
                  25.11.2023, 19:03:59.631	[error]: javascript.0 (496)     at Object.next (script.js.NSPanels.Panel2:14:53)
                  25.11.2023, 19:03:59.631	[error]: javascript.0 (496)     at script.js.NSPanels.Panel2:8:71
                  25.11.2023, 19:03:59.631	[error]: javascript.0 (496)     at __awaiter (script.js.NSPanels.Panel2:4:12)
                  25.11.2023, 19:03:59.631	[error]: javascript.0 (496)     at Init_dayjs (script.js.NSPanels.Panel2:956:12)
                  25.11.2023, 19:03:59.632	[error]: javascript.0 (496)     at script.js.NSPanels.Panel2:977:1
                  25.11.2023, 19:03:59.633	[warn ]: javascript.0 (496) script.js.NSPanels.Panel2: error at function init_dayjs: Cannot read properties of undefined (reading 'locale')
                  25.11.2023, 19:03:59.661	[info ]: javascript.0 (496) script.js.NSPanels.Panel2: setObjects enabled - create Alias Channels possible
                  25.11.2023, 19:03:59.676	[info ]: javascript.0 (496) script.js.NSPanels.Panel2: weather alias for accuweather.0. already exists
                  25.11.2023, 19:03:59.798	[info ]: javascript.0 (496) script.js.NSPanels.Panel2: registered 30 subscriptions, 7 schedules, 0 messages, 0 logs and 0 file subscriptions
                  25.11.2023, 19:04:00.464	[info ]: javascript.0 (496) script.js.NSPanels.Panel2: Desired TFT Firmware: 53 / v4.3.3
                  25.11.2023, 19:04:00.465	[info ]: javascript.0 (496) script.js.NSPanels.Panel2: Installed TFT Firmware: 53 / v4.3.3
                  25.11.2023, 19:04:00.583	[info ]: javascript.0 (496) script.js.NSPanels.Panel2: Debugmodus deaktiviert
                  25.11.2023, 19:04:00.587	[warn ]: javascript.0 (496) script.js.NSPanels.Panel2: error setState in function get_tasmota_status0"undefined" is not valid JSON
                  25.11.2023, 19:04:00.866	[warn ]: javascript.0 (496) script.js.NSPanels.Panel2: error result in function get_current_berry_driver_version: "undefined" is not valid JSON
                  25.11.2023, 19:04:04.016	[info ]: javascript.0 (496) script.js.NSPanels.Panel2: Start MQTT-Port-Check -------------------------------------
                  25.11.2023, 19:04:04.017	[info ]: javascript.0 (496) script.js.NSPanels.Panel2: -- admin.0                   - 8081
                  25.11.2023, 19:04:04.017	[info ]: javascript.0 (496) script.js.NSPanels.Panel2: -- hm-rpc.1                  - 1200
                  25.11.2023, 19:04:04.018	[info ]: javascript.0 (496) script.js.NSPanels.Panel2: -- mqtt.0                    - 1880
                  25.11.2023, 19:04:04.018	[info ]: javascript.0 (496) script.js.NSPanels.Panel2: -- sonoff.0                  - 1883
                  25.11.2023, 19:04:04.019	[info ]: javascript.0 (496) script.js.NSPanels.Panel2: -- web.0                     - 8082
                  25.11.2023, 19:04:04.019	[info ]: javascript.0 (496) script.js.NSPanels.Panel2: - MQTT-Port-Check OK: Instance of Adapter: mqtt.0 is running on Port:1880
                  25.11.2023, 19:04:04.020	[info ]: javascript.0 (496) script.js.NSPanels.Panel2: End MQTT-Port-Check ---------------------------------------
                  25.11.2023, 19:06:48.449	[warn ]: javascript.0 (496) script.js.NSPanels.Panel2: error at function HandleScreensaverUpdate: parseFormat is not a function
                  25.11.2023, 19:07:00.037	[warn ]: javascript.0 (496) script.js.NSPanels.Panel2: error at function HandleScreensaverUpdate: parseFormat is not a function
                  25.11.2023, 19:08:30.037	[warn ]: javascript.0 (496) script.js.NSPanels.Panel2: error at function HandleScreensaverUpdate: parseFormat is not a function
                  25.11.2023, 19:09:00.046	[warn ]: javascript.0 (496) script.js.NSPanels.Panel2: error at function HandleScreensaverUpdate: parseFormat is not a function
                  25.11.2023, 19:10:30.030	[warn ]: javascript.0 (496) script.js.NSPanels.Panel2: error at function HandleScreensaverUpdate: parseFormat is not a function
                  25.11.2023, 19:11:00.012	[warn ]: javascript.0 (496) script.js.NSPanels.Panel2: error at function HandleScreensaverUpdate: parseFormat is not a function
                  25.11.2023, 19:11:12.690	[info ]: javascript.0 (496) Stop script script.js.NSPanels.Panel2
                  25.11.2023, 19:11:22.536	[info ]: javascript.0 (1121) script.js.NSPanels.Panel2: compiling TypeScript source...
                  25.11.2023, 19:11:24.109	[info ]: javascript.0 (1121) script.js.NSPanels.Panel2: source code did not change, using cached compilation result...
                  25.11.2023, 19:11:24.519	[error]: javascript.0 (1121) script.js.NSPanels.Panel2: Error: Cannot find module 'dayjs'
                  25.11.2023, 19:11:24.523	[error]: javascript.0 (1121)     at script.js.NSPanels.Panel2:951:13
                  25.11.2023, 19:11:24.526	[error]: javascript.0 (1121) script.js.NSPanels.Panel2: Error: Cannot find module 'moment-parseformat'
                  25.11.2023, 19:11:24.528	[error]: javascript.0 (1121)     at script.js.NSPanels.Panel2:953:19
                  25.11.2023, 19:11:24.534	[error]: javascript.0 (1121) script.js.NSPanels.Panel2: Error: Cannot find module 'dayjs'
                  25.11.2023, 19:11:24.535	[error]: javascript.0 (1121)     at script.js.NSPanels.Panel2:960:27
                  25.11.2023, 19:11:24.536	[error]: javascript.0 (1121)     at step (script.js.NSPanels.Panel2:33:23)
                  25.11.2023, 19:11:24.536	[error]: javascript.0 (1121)     at Object.next (script.js.NSPanels.Panel2:14:53)
                  25.11.2023, 19:11:24.537	[error]: javascript.0 (1121)     at script.js.NSPanels.Panel2:8:71
                  25.11.2023, 19:11:24.538	[error]: javascript.0 (1121)     at __awaiter (script.js.NSPanels.Panel2:4:12)
                  25.11.2023, 19:11:24.539	[error]: javascript.0 (1121)     at Init_dayjs (script.js.NSPanels.Panel2:956:12)
                  25.11.2023, 19:11:24.539	[error]: javascript.0 (1121)     at script.js.NSPanels.Panel2:977:1
                  25.11.2023, 19:11:24.542	[error]: javascript.0 (1121) script.js.NSPanels.Panel2: Error: Cannot find module 'dayjs/locale/en'
                  25.11.2023, 19:11:24.543	[error]: javascript.0 (1121)     at script.js.NSPanels.Panel2:966:21
                  25.11.2023, 19:11:24.544	[error]: javascript.0 (1121)     at step (script.js.NSPanels.Panel2:33:23)
                  25.11.2023, 19:11:24.544	[error]: javascript.0 (1121)     at Object.next (script.js.NSPanels.Panel2:14:53)
                  25.11.2023, 19:11:24.544	[error]: javascript.0 (1121)     at script.js.NSPanels.Panel2:8:71
                  25.11.2023, 19:11:24.545	[error]: javascript.0 (1121)     at __awaiter (script.js.NSPanels.Panel2:4:12)
                  25.11.2023, 19:11:24.546	[error]: javascript.0 (1121)     at Init_dayjs (script.js.NSPanels.Panel2:956:12)
                  25.11.2023, 19:11:24.546	[error]: javascript.0 (1121)     at script.js.NSPanels.Panel2:977:1
                  25.11.2023, 19:11:24.549	[error]: javascript.0 (1121) script.js.NSPanels.Panel2: Error: Cannot find module 'dayjs/locale/de'
                  25.11.2023, 19:11:24.551	[error]: javascript.0 (1121)     at script.js.NSPanels.Panel2:966:21
                  25.11.2023, 19:11:24.552	[error]: javascript.0 (1121)     at step (script.js.NSPanels.Panel2:33:23)
                  25.11.2023, 19:11:24.552	[error]: javascript.0 (1121)     at Object.next (script.js.NSPanels.Panel2:14:53)
                  25.11.2023, 19:11:24.553	[error]: javascript.0 (1121)     at script.js.NSPanels.Panel2:8:71
                  25.11.2023, 19:11:24.553	[error]: javascript.0 (1121)     at __awaiter (script.js.NSPanels.Panel2:4:12)
                  25.11.2023, 19:11:24.554	[error]: javascript.0 (1121)     at Init_dayjs (script.js.NSPanels.Panel2:956:12)
                  25.11.2023, 19:11:24.554	[error]: javascript.0 (1121)     at script.js.NSPanels.Panel2:977:1
                  25.11.2023, 19:11:24.557	[error]: javascript.0 (1121) script.js.NSPanels.Panel2: Error: Cannot find module 'dayjs/locale/nl'
                  25.11.2023, 19:11:24.558	[error]: javascript.0 (1121)     at script.js.NSPanels.Panel2:966:21
                  25.11.2023, 19:11:24.558	[error]: javascript.0 (1121)     at step (script.js.NSPanels.Panel2:33:23)
                  25.11.2023, 19:11:24.558	[error]: javascript.0 (1121)     at Object.next (script.js.NSPanels.Panel2:14:53)
                  25.11.2023, 19:11:24.559	[error]: javascript.0 (1121)     at script.js.NSPanels.Panel2:8:71
                  25.11.2023, 19:11:24.559	[error]: javascript.0 (1121)     at __awaiter (script.js.NSPanels.Panel2:4:12)
                  25.11.2023, 19:11:24.560	[error]: javascript.0 (1121)     at Init_dayjs (script.js.NSPanels.Panel2:956:12)
                  25.11.2023, 19:11:24.560	[error]: javascript.0 (1121)     at script.js.NSPanels.Panel2:977:1
                  25.11.2023, 19:11:24.562	[error]: javascript.0 (1121) script.js.NSPanels.Panel2: Error: Cannot find module 'dayjs/locale/da'
                  25.11.2023, 19:11:24.563	[error]: javascript.0 (1121)     at script.js.NSPanels.Panel2:966:21
                  25.11.2023, 19:11:24.563	[error]: javascript.0 (1121)     at step (script.js.NSPanels.Panel2:33:23)
                  25.11.2023, 19:11:24.564	[error]: javascript.0 (1121)     at Object.next (script.js.NSPanels.Panel2:14:53)
                  25.11.2023, 19:11:24.564	[error]: javascript.0 (1121)     at script.js.NSPanels.Panel2:8:71
                  25.11.2023, 19:11:24.564	[error]: javascript.0 (1121)     at __awaiter (script.js.NSPanels.Panel2:4:12)
                  25.11.2023, 19:11:24.565	[error]: javascript.0 (1121)     at Init_dayjs (script.js.NSPanels.Panel2:956:12)
                  25.11.2023, 19:11:24.565	[error]: javascript.0 (1121)     at script.js.NSPanels.Panel2:977:1
                  25.11.2023, 19:11:24.567	[error]: javascript.0 (1121) script.js.NSPanels.Panel2: Error: Cannot find module 'dayjs/locale/es'
                  25.11.2023, 19:11:24.570	[error]: javascript.0 (1121)     at script.js.NSPanels.Panel2:966:21
                  25.11.2023, 19:11:24.571	[error]: javascript.0 (1121)     at step (script.js.NSPanels.Panel2:33:23)
                  25.11.2023, 19:11:24.572	[error]: javascript.0 (1121)     at Object.next (script.js.NSPanels.Panel2:14:53)
                  25.11.2023, 19:11:24.573	[error]: javascript.0 (1121)     at script.js.NSPanels.Panel2:8:71
                  25.11.2023, 19:11:24.574	[error]: javascript.0 (1121)     at __awaiter (script.js.NSPanels.Panel2:4:12)
                  25.11.2023, 19:11:24.575	[error]: javascript.0 (1121)     at Init_dayjs (script.js.NSPanels.Panel2:956:12)
                  25.11.2023, 19:11:24.576	[error]: javascript.0 (1121)     at script.js.NSPanels.Panel2:977:1
                  25.11.2023, 19:11:24.580	[error]: javascript.0 (1121) script.js.NSPanels.Panel2: Error: Cannot find module 'dayjs/locale/fr'
                  25.11.2023, 19:11:24.581	[error]: javascript.0 (1121)     at script.js.NSPanels.Panel2:966:21
                  25.11.2023, 19:11:24.581	[error]: javascript.0 (1121)     at step (script.js.NSPanels.Panel2:33:23)
                  25.11.2023, 19:11:24.582	[error]: javascript.0 (1121)     at Object.next (script.js.NSPanels.Panel2:14:53)
                  25.11.2023, 19:11:24.582	[error]: javascript.0 (1121)     at script.js.NSPanels.Panel2:8:71
                  25.11.2023, 19:11:24.583	[error]: javascript.0 (1121)     at __awaiter (script.js.NSPanels.Panel2:4:12)
                  25.11.2023, 19:11:24.583	[error]: javascript.0 (1121)     at Init_dayjs (script.js.NSPanels.Panel2:956:12)
                  25.11.2023, 19:11:24.583	[error]: javascript.0 (1121)     at script.js.NSPanels.Panel2:977:1
                  25.11.2023, 19:11:24.585	[error]: javascript.0 (1121) script.js.NSPanels.Panel2: Error: Cannot find module 'dayjs/locale/it'
                  25.11.2023, 19:11:24.586	[error]: javascript.0 (1121)     at script.js.NSPanels.Panel2:966:21
                  25.11.2023, 19:11:24.587	[error]: javascript.0 (1121)     at step (script.js.NSPanels.Panel2:33:23)
                  25.11.2023, 19:11:24.587	[error]: javascript.0 (1121)     at Object.next (script.js.NSPanels.Panel2:14:53)
                  25.11.2023, 19:11:24.587	[error]: javascript.0 (1121)     at script.js.NSPanels.Panel2:8:71
                  25.11.2023, 19:11:24.588	[error]: javascript.0 (1121)     at __awaiter (script.js.NSPanels.Panel2:4:12)
                  25.11.2023, 19:11:24.588	[error]: javascript.0 (1121)     at Init_dayjs (script.js.NSPanels.Panel2:956:12)
                  25.11.2023, 19:11:24.588	[error]: javascript.0 (1121)     at script.js.NSPanels.Panel2:977:1
                  25.11.2023, 19:11:24.590	[error]: javascript.0 (1121) script.js.NSPanels.Panel2: Error: Cannot find module 'dayjs/locale/ru'
                  25.11.2023, 19:11:24.592	[error]: javascript.0 (1121)     at script.js.NSPanels.Panel2:966:21
                  25.11.2023, 19:11:24.592	[error]: javascript.0 (1121)     at step (script.js.NSPanels.Panel2:33:23)
                  25.11.2023, 19:11:24.592	[error]: javascript.0 (1121)     at Object.next (script.js.NSPanels.Panel2:14:53)
                  25.11.2023, 19:11:24.593	[error]: javascript.0 (1121)     at script.js.NSPanels.Panel2:8:71
                  25.11.2023, 19:11:24.593	[error]: javascript.0 (1121)     at __awaiter (script.js.NSPanels.Panel2:4:12)
                  25.11.2023, 19:11:24.593	[error]: javascript.0 (1121)     at Init_dayjs (script.js.NSPanels.Panel2:956:12)
                  25.11.2023, 19:11:24.594	[error]: javascript.0 (1121)     at script.js.NSPanels.Panel2:977:1
                  25.11.2023, 19:11:24.596	[error]: javascript.0 (1121) script.js.NSPanels.Panel2: Error: Cannot find module 'dayjs/locale/nb'
                  25.11.2023, 19:11:24.597	[error]: javascript.0 (1121)     at script.js.NSPanels.Panel2:966:21
                  25.11.2023, 19:11:24.597	[error]: javascript.0 (1121)     at step (script.js.NSPanels.Panel2:33:23)
                  25.11.2023, 19:11:24.597	[error]: javascript.0 (1121)     at Object.next (script.js.NSPanels.Panel2:14:53)
                  25.11.2023, 19:11:24.598	[error]: javascript.0 (1121)     at script.js.NSPanels.Panel2:8:71
                  25.11.2023, 19:11:24.598	[error]: javascript.0 (1121)     at __awaiter (script.js.NSPanels.Panel2:4:12)
                  25.11.2023, 19:11:24.599	[error]: javascript.0 (1121)     at Init_dayjs (script.js.NSPanels.Panel2:956:12)
                  25.11.2023, 19:11:24.599	[error]: javascript.0 (1121)     at script.js.NSPanels.Panel2:977:1
                  25.11.2023, 19:11:24.601	[error]: javascript.0 (1121) script.js.NSPanels.Panel2: Error: Cannot find module 'dayjs/locale/nn'
                  25.11.2023, 19:11:24.602	[error]: javascript.0 (1121)     at script.js.NSPanels.Panel2:966:21
                  25.11.2023, 19:11:24.603	[error]: javascript.0 (1121)     at step (script.js.NSPanels.Panel2:33:23)
                  25.11.2023, 19:11:24.603	[error]: javascript.0 (1121)     at Object.next (script.js.NSPanels.Panel2:14:53)
                  25.11.2023, 19:11:24.603	[error]: javascript.0 (1121)     at script.js.NSPanels.Panel2:8:71
                  25.11.2023, 19:11:24.604	[error]: javascript.0 (1121)     at __awaiter (script.js.NSPanels.Panel2:4:12)
                  25.11.2023, 19:11:24.604	[error]: javascript.0 (1121)     at Init_dayjs (script.js.NSPanels.Panel2:956:12)
                  25.11.2023, 19:11:24.604	[error]: javascript.0 (1121)     at script.js.NSPanels.Panel2:977:1
                  25.11.2023, 19:11:24.611	[error]: javascript.0 (1121) script.js.NSPanels.Panel2: Error: Cannot find module 'dayjs/locale/pl'
                  25.11.2023, 19:11:24.612	[error]: javascript.0 (1121)     at script.js.NSPanels.Panel2:966:21
                  25.11.2023, 19:11:24.613	[error]: javascript.0 (1121)     at step (script.js.NSPanels.Panel2:33:23)
                  25.11.2023, 19:11:24.613	[error]: javascript.0 (1121)     at Object.next (script.js.NSPanels.Panel2:14:53)
                  25.11.2023, 19:11:24.613	[error]: javascript.0 (1121)     at script.js.NSPanels.Panel2:8:71
                  25.11.2023, 19:11:24.614	[error]: javascript.0 (1121)     at __awaiter (script.js.NSPanels.Panel2:4:12)
                  25.11.2023, 19:11:24.614	[error]: javascript.0 (1121)     at Init_dayjs (script.js.NSPanels.Panel2:956:12)
                  25.11.2023, 19:11:24.614	[error]: javascript.0 (1121)     at script.js.NSPanels.Panel2:977:1
                  25.11.2023, 19:11:24.616	[error]: javascript.0 (1121) script.js.NSPanels.Panel2: Error: Cannot find module 'dayjs/locale/pt'
                  25.11.2023, 19:11:24.618	[error]: javascript.0 (1121)     at script.js.NSPanels.Panel2:966:21
                  25.11.2023, 19:11:24.618	[error]: javascript.0 (1121)     at step (script.js.NSPanels.Panel2:33:23)
                  25.11.2023, 19:11:24.618	[error]: javascript.0 (1121)     at Object.next (script.js.NSPanels.Panel2:14:53)
                  25.11.2023, 19:11:24.619	[error]: javascript.0 (1121)     at script.js.NSPanels.Panel2:8:71
                  25.11.2023, 19:11:24.619	[error]: javascript.0 (1121)     at __awaiter (script.js.NSPanels.Panel2:4:12)
                  25.11.2023, 19:11:24.620	[error]: javascript.0 (1121)     at Init_dayjs (script.js.NSPanels.Panel2:956:12)
                  25.11.2023, 19:11:24.620	[error]: javascript.0 (1121)     at script.js.NSPanels.Panel2:977:1
                  25.11.2023, 19:11:24.622	[error]: javascript.0 (1121) script.js.NSPanels.Panel2: Error: Cannot find module 'dayjs/locale/af'
                  25.11.2023, 19:11:24.623	[error]: javascript.0 (1121)     at script.js.NSPanels.Panel2:966:21
                  25.11.2023, 19:11:24.624	[error]: javascript.0 (1121)     at step (script.js.NSPanels.Panel2:33:23)
                  25.11.2023, 19:11:24.624	[error]: javascript.0 (1121)     at Object.next (script.js.NSPanels.Panel2:14:53)
                  25.11.2023, 19:11:24.624	[error]: javascript.0 (1121)     at script.js.NSPanels.Panel2:8:71
                  25.11.2023, 19:11:24.625	[error]: javascript.0 (1121)     at __awaiter (script.js.NSPanels.Panel2:4:12)
                  25.11.2023, 19:11:24.625	[error]: javascript.0 (1121)     at Init_dayjs (script.js.NSPanels.Panel2:956:12)
                  25.11.2023, 19:11:24.625	[error]: javascript.0 (1121)     at script.js.NSPanels.Panel2:977:1
                  25.11.2023, 19:11:24.627	[error]: javascript.0 (1121) script.js.NSPanels.Panel2: Error: Cannot find module 'dayjs/locale/ar'
                  25.11.2023, 19:11:24.628	[error]: javascript.0 (1121)     at script.js.NSPanels.Panel2:966:21
                  25.11.2023, 19:11:24.629	[error]: javascript.0 (1121)     at step (script.js.NSPanels.Panel2:33:23)
                  25.11.2023, 19:11:24.629	[error]: javascript.0 (1121)     at Object.next (script.js.NSPanels.Panel2:14:53)
                  25.11.2023, 19:11:24.629	[error]: javascript.0 (1121)     at script.js.NSPanels.Panel2:8:71
                  25.11.2023, 19:11:24.630	[error]: javascript.0 (1121)     at __awaiter (script.js.NSPanels.Panel2:4:12)
                  25.11.2023, 19:11:24.630	[error]: javascript.0 (1121)     at Init_dayjs (script.js.NSPanels.Panel2:956:12)
                  25.11.2023, 19:11:24.630	[error]: javascript.0 (1121)     at script.js.NSPanels.Panel2:977:1
                  25.11.2023, 19:11:24.632	[error]: javascript.0 (1121) script.js.NSPanels.Panel2: Error: Cannot find module 'dayjs/locale/bg'
                  25.11.2023, 19:11:24.634	[error]: javascript.0 (1121)     at script.js.NSPanels.Panel2:966:21
                  25.11.2023, 19:11:24.634	[error]: javascript.0 (1121)     at step (script.js.NSPanels.Panel2:33:23)
                  25.11.2023, 19:11:24.634	[error]: javascript.0 (1121)     at Object.next (script.js.NSPanels.Panel2:14:53)
                  25.11.2023, 19:11:24.634	[error]: javascript.0 (1121)     at script.js.NSPanels.Panel2:8:71
                  25.11.2023, 19:11:24.635	[error]: javascript.0 (1121)     at __awaiter (script.js.NSPanels.Panel2:4:12)
                  25.11.2023, 19:11:24.635	[error]: javascript.0 (1121)     at Init_dayjs (script.js.NSPanels.Panel2:956:12)
                  25.11.2023, 19:11:24.636	[error]: javascript.0 (1121)     at script.js.NSPanels.Panel2:977:1
                  25.11.2023, 19:11:24.638	[error]: javascript.0 (1121) script.js.NSPanels.Panel2: Error: Cannot find module 'dayjs/locale/ca'
                  25.11.2023, 19:11:24.649	[error]: javascript.0 (1121)     at script.js.NSPanels.Panel2:966:21
                  25.11.2023, 19:11:24.649	[error]: javascript.0 (1121)     at step (script.js.NSPanels.Panel2:33:23)
                  25.11.2023, 19:11:24.650	[error]: javascript.0 (1121)     at Object.next (script.js.NSPanels.Panel2:14:53)
                  25.11.2023, 19:11:24.650	[error]: javascript.0 (1121)     at script.js.NSPanels.Panel2:8:71
                  25.11.2023, 19:11:24.651	[error]: javascript.0 (1121)     at __awaiter (script.js.NSPanels.Panel2:4:12)
                  25.11.2023, 19:11:24.651	[error]: javascript.0 (1121)     at Init_dayjs (script.js.NSPanels.Panel2:956:12)
                  25.11.2023, 19:11:24.652	[error]: javascript.0 (1121)     at script.js.NSPanels.Panel2:977:1
                  25.11.2023, 19:11:24.654	[error]: javascript.0 (1121) script.js.NSPanels.Panel2: Error: Cannot find module 'dayjs/locale/cs'
                  25.11.2023, 19:11:24.669	[error]: javascript.0 (1121)     at script.js.NSPanels.Panel2:966:21
                  25.11.2023, 19:11:24.669	[error]: javascript.0 (1121)     at step (script.js.NSPanels.Panel2:33:23)
                  25.11.2023, 19:11:24.670	[error]: javascript.0 (1121)     at Object.next (script.js.NSPanels.Panel2:14:53)
                  25.11.2023, 19:11:24.670	[error]: javascript.0 (1121)     at script.js.NSPanels.Panel2:8:71
                  25.11.2023, 19:11:24.670	[error]: javascript.0 (1121)     at __awaiter (script.js.NSPanels.Panel2:4:12)
                  25.11.2023, 19:11:24.671	[error]: javascript.0 (1121)     at Init_dayjs (script.js.NSPanels.Panel2:956:12)
                  25.11.2023, 19:11:24.671	[error]: javascript.0 (1121)     at script.js.NSPanels.Panel2:977:1
                  25.11.2023, 19:11:24.673	[error]: javascript.0 (1121) script.js.NSPanels.Panel2: Error: Cannot find module 'dayjs/locale/el'
                  25.11.2023, 19:11:24.674	[error]: javascript.0 (1121)     at script.js.NSPanels.Panel2:966:21
                  25.11.2023, 19:11:24.674	[error]: javascript.0 (1121)     at step (script.js.NSPanels.Panel2:33:23)
                  25.11.2023, 19:11:24.675	[error]: javascript.0 (1121)     at Object.next (script.js.NSPanels.Panel2:14:53)
                  25.11.2023, 19:11:24.675	[error]: javascript.0 (1121)     at script.js.NSPanels.Panel2:8:71
                  25.11.2023, 19:11:24.675	[error]: javascript.0 (1121)     at __awaiter (script.js.NSPanels.Panel2:4:12)
                  25.11.2023, 19:11:24.676	[error]: javascript.0 (1121)     at Init_dayjs (script.js.NSPanels.Panel2:956:12)
                  25.11.2023, 19:11:24.676	[error]: javascript.0 (1121)     at script.js.NSPanels.Panel2:977:1
                  25.11.2023, 19:11:24.678	[error]: javascript.0 (1121) script.js.NSPanels.Panel2: Error: Cannot find module 'dayjs/locale/et'
                  25.11.2023, 19:11:24.679	[error]: javascript.0 (1121)     at script.js.NSPanels.Panel2:966:21
                  25.11.2023, 19:11:24.679	[error]: javascript.0 (1121)     at step (script.js.NSPanels.Panel2:33:23)
                  25.11.2023, 19:11:24.679	[error]: javascript.0 (1121)     at Object.next (script.js.NSPanels.Panel2:14:53)
                  25.11.2023, 19:11:24.680	[error]: javascript.0 (1121)     at script.js.NSPanels.Panel2:8:71
                  25.11.2023, 19:11:24.680	[error]: javascript.0 (1121)     at __awaiter (script.js.NSPanels.Panel2:4:12)
                  25.11.2023, 19:11:24.680	[error]: javascript.0 (1121)     at Init_dayjs (script.js.NSPanels.Panel2:956:12)
                  25.11.2023, 19:11:24.681	[error]: javascript.0 (1121)     at script.js.NSPanels.Panel2:977:1
                  25.11.2023, 19:11:24.683	[error]: javascript.0 (1121) script.js.NSPanels.Panel2: Error: Cannot find module 'dayjs/locale/fa'
                  25.11.2023, 19:11:24.684	[error]: javascript.0 (1121)     at script.js.NSPanels.Panel2:966:21
                  25.11.2023, 19:11:24.684	[error]: javascript.0 (1121)     at step (script.js.NSPanels.Panel2:33:23)
                  25.11.2023, 19:11:24.684	[error]: javascript.0 (1121)     at Object.next (script.js.NSPanels.Panel2:14:53)
                  25.11.2023, 19:11:24.684	[error]: javascript.0 (1121)     at script.js.NSPanels.Panel2:8:71
                  25.11.2023, 19:11:24.685	[error]: javascript.0 (1121)     at __awaiter (script.js.NSPanels.Panel2:4:12)
                  25.11.2023, 19:11:24.685	[error]: javascript.0 (1121)     at Init_dayjs (script.js.NSPanels.Panel2:956:12)
                  25.11.2023, 19:11:24.685	[error]: javascript.0 (1121)     at script.js.NSPanels.Panel2:977:1
                  25.11.2023, 19:11:24.687	[error]: javascript.0 (1121) script.js.NSPanels.Panel2: Error: Cannot find module 'dayjs/locale/fi'
                  25.11.2023, 19:11:24.688	[error]: javascript.0 (1121)     at script.js.NSPanels.Panel2:966:21
                  25.11.2023, 19:11:24.689	[error]: javascript.0 (1121)     at step (script.js.NSPanels.Panel2:33:23)
                  25.11.2023, 19:11:24.689	[error]: javascript.0 (1121)     at Object.next (script.js.NSPanels.Panel2:14:53)
                  25.11.2023, 19:11:24.689	[error]: javascript.0 (1121)     at script.js.NSPanels.Panel2:8:71
                  25.11.2023, 19:11:24.690	[error]: javascript.0 (1121)     at __awaiter (script.js.NSPanels.Panel2:4:12)
                  25.11.2023, 19:11:24.690	[error]: javascript.0 (1121)     at Init_dayjs (script.js.NSPanels.Panel2:956:12)
                  25.11.2023, 19:11:24.690	[error]: javascript.0 (1121)     at script.js.NSPanels.Panel2:977:1
                  25.11.2023, 19:11:24.692	[error]: javascript.0 (1121) script.js.NSPanels.Panel2: Error: Cannot find module 'dayjs/locale/he'
                  25.11.2023, 19:11:24.694	[error]: javascript.0 (1121)     at script.js.NSPanels.Panel2:966:21
                  25.11.2023, 19:11:24.694	[error]: javascript.0 (1121)     at step (script.js.NSPanels.Panel2:33:23)
                  25.11.2023, 19:11:24.694	[error]: javascript.0 (1121)     at Object.next (script.js.NSPanels.Panel2:14:53)
                  25.11.2023, 19:11:24.695	[error]: javascript.0 (1121)     at script.js.NSPanels.Panel2:8:71
                  25.11.2023, 19:11:24.695	[error]: javascript.0 (1121)     at __awaiter (script.js.NSPanels.Panel2:4:12)
                  25.11.2023, 19:11:24.696	[error]: javascript.0 (1121)     at Init_dayjs (script.js.NSPanels.Panel2:956:12)
                  25.11.2023, 19:11:24.696	[error]: javascript.0 (1121)     at script.js.NSPanels.Panel2:977:1
                  25.11.2023, 19:11:24.698	[error]: javascript.0 (1121) script.js.NSPanels.Panel2: Error: Cannot find module 'dayjs/locale/hr'
                  25.11.2023, 19:11:24.700	[error]: javascript.0 (1121)     at script.js.NSPanels.Panel2:966:21
                  25.11.2023, 19:11:24.700	[error]: javascript.0 (1121)     at step (script.js.NSPanels.Panel2:33:23)
                  25.11.2023, 19:11:24.700	[error]: javascript.0 (1121)     at Object.next (script.js.NSPanels.Panel2:14:53)
                  25.11.2023, 19:11:24.700	[error]: javascript.0 (1121)     at script.js.NSPanels.Panel2:8:71
                  25.11.2023, 19:11:24.701	[error]: javascript.0 (1121)     at __awaiter (script.js.NSPanels.Panel2:4:12)
                  25.11.2023, 19:11:24.701	[error]: javascript.0 (1121)     at Init_dayjs (script.js.NSPanels.Panel2:956:12)
                  25.11.2023, 19:11:24.702	[error]: javascript.0 (1121)     at script.js.NSPanels.Panel2:977:1
                  25.11.2023, 19:11:24.704	[error]: javascript.0 (1121) script.js.NSPanels.Panel2: Error: Cannot find module 'dayjs/locale/hu'
                  25.11.2023, 19:11:24.705	[error]: javascript.0 (1121)     at script.js.NSPanels.Panel2:966:21
                  25.11.2023, 19:11:24.705	[error]: javascript.0 (1121)     at step (script.js.NSPanels.Panel2:33:23)
                  25.11.2023, 19:11:24.706	[error]: javascript.0 (1121)     at Object.next (script.js.NSPanels.Panel2:14:53)
                  25.11.2023, 19:11:24.706	[error]: javascript.0 (1121)     at script.js.NSPanels.Panel2:8:71
                  25.11.2023, 19:11:24.706	[error]: javascript.0 (1121)     at __awaiter (script.js.NSPanels.Panel2:4:12)
                  25.11.2023, 19:11:24.707	[error]: javascript.0 (1121)     at Init_dayjs (script.js.NSPanels.Panel2:956:12)
                  25.11.2023, 19:11:24.707	[error]: javascript.0 (1121)     at script.js.NSPanels.Panel2:977:1
                  25.11.2023, 19:11:24.709	[error]: javascript.0 (1121) script.js.NSPanels.Panel2: Error: Cannot find module 'dayjs/locale/hy-am'
                  25.11.2023, 19:11:24.711	[error]: javascript.0 (1121)     at script.js.NSPanels.Panel2:966:21
                  25.11.2023, 19:11:24.711	[error]: javascript.0 (1121)     at step (script.js.NSPanels.Panel2:33:23)
                  25.11.2023, 19:11:24.711	[error]: javascript.0 (1121)     at Object.next (script.js.NSPanels.Panel2:14:53)
                  25.11.2023, 19:11:24.711	[error]: javascript.0 (1121)     at script.js.NSPanels.Panel2:8:71
                  25.11.2023, 19:11:24.712	[error]: javascript.0 (1121)     at __awaiter (script.js.NSPanels.Panel2:4:12)
                  25.11.2023, 19:11:24.712	[error]: javascript.0 (1121)     at Init_dayjs (script.js.NSPanels.Panel2:956:12)
                  25.11.2023, 19:11:24.712	[error]: javascript.0 (1121)     at script.js.NSPanels.Panel2:977:1
                  25.11.2023, 19:11:24.714	[error]: javascript.0 (1121) script.js.NSPanels.Panel2: Error: Cannot find module 'dayjs/locale/id'
                  25.11.2023, 19:11:24.715	[error]: javascript.0 (1121)     at script.js.NSPanels.Panel2:966:21
                  25.11.2023, 19:11:24.715	[error]: javascript.0 (1121)     at step (script.js.NSPanels.Panel2:33:23)
                  25.11.2023, 19:11:24.716	[error]: javascript.0 (1121)     at Object.next (script.js.NSPanels.Panel2:14:53)
                  25.11.2023, 19:11:24.716	[error]: javascript.0 (1121)     at script.js.NSPanels.Panel2:8:71
                  25.11.2023, 19:11:24.717	[error]: javascript.0 (1121)     at __awaiter (script.js.NSPanels.Panel2:4:12)
                  25.11.2023, 19:11:24.717	[error]: javascript.0 (1121)     at Init_dayjs (script.js.NSPanels.Panel2:956:12)
                  25.11.2023, 19:11:24.717	[error]: javascript.0 (1121)     at script.js.NSPanels.Panel2:977:1
                  25.11.2023, 19:11:24.721	[error]: javascript.0 (1121) script.js.NSPanels.Panel2: Error: Cannot find module 'dayjs/locale/is'
                  25.11.2023, 19:11:24.722	[error]: javascript.0 (1121)     at script.js.NSPanels.Panel2:966:21
                  25.11.2023, 19:11:24.723	[error]: javascript.0 (1121)     at step (script.js.NSPanels.Panel2:33:23)
                  25.11.2023, 19:11:24.723	[error]: javascript.0 (1121)     at Object.next (script.js.NSPanels.Panel2:14:53)
                  25.11.2023, 19:11:24.723	[error]: javascript.0 (1121)     at script.js.NSPanels.Panel2:8:71
                  25.11.2023, 19:11:24.723	[error]: javascript.0 (1121)     at __awaiter (script.js.NSPanels.Panel2:4:12)
                  25.11.2023, 19:11:24.724	[error]: javascript.0 (1121)     at Init_dayjs (script.js.NSPanels.Panel2:956:12)
                  25.11.2023, 19:11:24.724	[error]: javascript.0 (1121)     at script.js.NSPanels.Panel2:977:1
                  25.11.2023, 19:11:24.726	[error]: javascript.0 (1121) script.js.NSPanels.Panel2: Error: Cannot find module 'dayjs/locale/lb'
                  25.11.2023, 19:11:24.727	[error]: javascript.0 (1121)     at script.js.NSPanels.Panel2:966:21
                  25.11.2023, 19:11:24.727	[error]: javascript.0 (1121)     at step (script.js.NSPanels.Panel2:33:23)
                  25.11.2023, 19:11:24.728	[error]: javascript.0 (1121)     at Object.next (script.js.NSPanels.Panel2:14:53)
                  25.11.2023, 19:11:24.728	[error]: javascript.0 (1121)     at script.js.NSPanels.Panel2:8:71
                  25.11.2023, 19:11:24.729	[error]: javascript.0 (1121)     at __awaiter (script.js.NSPanels.Panel2:4:12)
                  25.11.2023, 19:11:24.730	[error]: javascript.0 (1121)     at Init_dayjs (script.js.NSPanels.Panel2:956:12)
                  25.11.2023, 19:11:24.731	[error]: javascript.0 (1121)     at script.js.NSPanels.Panel2:977:1
                  25.11.2023, 19:11:24.735	[error]: javascript.0 (1121) script.js.NSPanels.Panel2: Error: Cannot find module 'dayjs/locale/lt'
                  25.11.2023, 19:11:24.736	[error]: javascript.0 (1121)     at script.js.NSPanels.Panel2:966:21
                  25.11.2023, 19:11:24.737	[error]: javascript.0 (1121)     at step (script.js.NSPanels.Panel2:33:23)
                  25.11.2023, 19:11:24.737	[error]: javascript.0 (1121)     at Object.next (script.js.NSPanels.Panel2:14:53)
                  25.11.2023, 19:11:24.737	[error]: javascript.0 (1121)     at script.js.NSPanels.Panel2:8:71
                  25.11.2023, 19:11:24.738	[error]: javascript.0 (1121)     at __awaiter (script.js.NSPanels.Panel2:4:12)
                  25.11.2023, 19:11:24.738	[error]: javascript.0 (1121)     at Init_dayjs (script.js.NSPanels.Panel2:956:12)
                  25.11.2023, 19:11:24.739	[error]: javascript.0 (1121)     at script.js.NSPanels.Panel2:977:1
                  25.11.2023, 19:11:24.741	[error]: javascript.0 (1121) script.js.NSPanels.Panel2: Error: Cannot find module 'dayjs/locale/ro'
                  25.11.2023, 19:11:24.743	[error]: javascript.0 (1121)     at script.js.NSPanels.Panel2:966:21
                  25.11.2023, 19:11:24.743	[error]: javascript.0 (1121)     at step (script.js.NSPanels.Panel2:33:23)
                  25.11.2023, 19:11:24.743	[error]: javascript.0 (1121)     at Object.next (script.js.NSPanels.Panel2:14:53)
                  25.11.2023, 19:11:24.744	[error]: javascript.0 (1121)     at script.js.NSPanels.Panel2:8:71
                  25.11.2023, 19:11:24.744	[error]: javascript.0 (1121)     at __awaiter (script.js.NSPanels.Panel2:4:12)
                  25.11.2023, 19:11:24.745	[error]: javascript.0 (1121)     at Init_dayjs (script.js.NSPanels.Panel2:956:12)
                  25.11.2023, 19:11:24.745	[error]: javascript.0 (1121)     at script.js.NSPanels.Panel2:977:1
                  25.11.2023, 19:11:24.747	[error]: javascript.0 (1121) script.js.NSPanels.Panel2: Error: Cannot find module 'dayjs/locale/sk'
                  25.11.2023, 19:11:24.751	[error]: javascript.0 (1121)     at script.js.NSPanels.Panel2:966:21
                  25.11.2023, 19:11:24.751	[error]: javascript.0 (1121)     at step (script.js.NSPanels.Panel2:33:23)
                  25.11.2023, 19:11:24.752	[error]: javascript.0 (1121)     at Object.next (script.js.NSPanels.Panel2:14:53)
                  25.11.2023, 19:11:24.752	[error]: javascript.0 (1121)     at script.js.NSPanels.Panel2:8:71
                  25.11.2023, 19:11:24.752	[error]: javascript.0 (1121)     at __awaiter (script.js.NSPanels.Panel2:4:12)
                  25.11.2023, 19:11:24.752	[error]: javascript.0 (1121)     at Init_dayjs (script.js.NSPanels.Panel2:956:12)
                  25.11.2023, 19:11:24.753	[error]: javascript.0 (1121)     at script.js.NSPanels.Panel2:977:1
                  25.11.2023, 19:11:24.754	[error]: javascript.0 (1121) script.js.NSPanels.Panel2: Error: Cannot find module 'dayjs/locale/sl'
                  25.11.2023, 19:11:24.756	[error]: javascript.0 (1121)     at script.js.NSPanels.Panel2:966:21
                  25.11.2023, 19:11:24.756	[error]: javascript.0 (1121)     at step (script.js.NSPanels.Panel2:33:23)
                  25.11.2023, 19:11:24.756	[error]: javascript.0 (1121)     at Object.next (script.js.NSPanels.Panel2:14:53)
                  25.11.2023, 19:11:24.756	[error]: javascript.0 (1121)     at script.js.NSPanels.Panel2:8:71
                  25.11.2023, 19:11:24.757	[error]: javascript.0 (1121)     at __awaiter (script.js.NSPanels.Panel2:4:12)
                  25.11.2023, 19:11:24.757	[error]: javascript.0 (1121)     at Init_dayjs (script.js.NSPanels.Panel2:956:12)
                  25.11.2023, 19:11:24.757	[error]: javascript.0 (1121)     at script.js.NSPanels.Panel2:977:1
                  25.11.2023, 19:11:24.760	[error]: javascript.0 (1121) script.js.NSPanels.Panel2: Error: Cannot find module 'dayjs/locale/sv'
                  25.11.2023, 19:11:24.761	[error]: javascript.0 (1121)     at script.js.NSPanels.Panel2:966:21
                  25.11.2023, 19:11:24.761	[error]: javascript.0 (1121)     at step (script.js.NSPanels.Panel2:33:23)
                  25.11.2023, 19:11:24.761	[error]: javascript.0 (1121)     at Object.next (script.js.NSPanels.Panel2:14:53)
                  25.11.2023, 19:11:24.761	[error]: javascript.0 (1121)     at script.js.NSPanels.Panel2:8:71
                  25.11.2023, 19:11:24.762	[error]: javascript.0 (1121)     at __awaiter (script.js.NSPanels.Panel2:4:12)
                  25.11.2023, 19:11:24.762	[error]: javascript.0 (1121)     at Init_dayjs (script.js.NSPanels.Panel2:956:12)
                  25.11.2023, 19:11:24.762	[error]: javascript.0 (1121)     at script.js.NSPanels.Panel2:977:1
                  25.11.2023, 19:11:24.764	[error]: javascript.0 (1121) script.js.NSPanels.Panel2: Error: Cannot find module 'dayjs/locale/th'
                  25.11.2023, 19:11:24.766	[error]: javascript.0 (1121)     at script.js.NSPanels.Panel2:966:21
                  25.11.2023, 19:11:24.766	[error]: javascript.0 (1121)     at step (script.js.NSPanels.Panel2:33:23)
                  25.11.2023, 19:11:24.766	[error]: javascript.0 (1121)     at Object.next (script.js.NSPanels.Panel2:14:53)
                  25.11.2023, 19:11:24.767	[error]: javascript.0 (1121)     at script.js.NSPanels.Panel2:8:71
                  25.11.2023, 19:11:24.767	[error]: javascript.0 (1121)     at __awaiter (script.js.NSPanels.Panel2:4:12)
                  25.11.2023, 19:11:24.768	[error]: javascript.0 (1121)     at Init_dayjs (script.js.NSPanels.Panel2:956:12)
                  25.11.2023, 19:11:24.768	[error]: javascript.0 (1121)     at script.js.NSPanels.Panel2:977:1
                  25.11.2023, 19:11:24.770	[error]: javascript.0 (1121) script.js.NSPanels.Panel2: Error: Cannot find module 'dayjs/locale/tr'
                  25.11.2023, 19:11:24.773	[error]: javascript.0 (1121)     at script.js.NSPanels.Panel2:966:21
                  25.11.2023, 19:11:24.779	[error]: javascript.0 (1121)     at step (script.js.NSPanels.Panel2:33:23)
                  25.11.2023, 19:11:24.780	[error]: javascript.0 (1121)     at Object.next (script.js.NSPanels.Panel2:14:53)
                  25.11.2023, 19:11:24.780	[error]: javascript.0 (1121)     at script.js.NSPanels.Panel2:8:71
                  25.11.2023, 19:11:24.781	[error]: javascript.0 (1121)     at __awaiter (script.js.NSPanels.Panel2:4:12)
                  25.11.2023, 19:11:24.782	[error]: javascript.0 (1121)     at Init_dayjs (script.js.NSPanels.Panel2:956:12)
                  25.11.2023, 19:11:24.782	[error]: javascript.0 (1121)     at script.js.NSPanels.Panel2:977:1
                  25.11.2023, 19:11:24.785	[error]: javascript.0 (1121) script.js.NSPanels.Panel2: Error: Cannot find module 'dayjs/locale/uk'
                  25.11.2023, 19:11:24.786	[error]: javascript.0 (1121)     at script.js.NSPanels.Panel2:966:21
                  25.11.2023, 19:11:24.787	[error]: javascript.0 (1121)     at step (script.js.NSPanels.Panel2:33:23)
                  25.11.2023, 19:11:24.787	[error]: javascript.0 (1121)     at Object.next (script.js.NSPanels.Panel2:14:53)
                  25.11.2023, 19:11:24.787	[error]: javascript.0 (1121)     at script.js.NSPanels.Panel2:8:71
                  25.11.2023, 19:11:24.787	[error]: javascript.0 (1121)     at __awaiter (script.js.NSPanels.Panel2:4:12)
                  25.11.2023, 19:11:24.788	[error]: javascript.0 (1121)     at Init_dayjs (script.js.NSPanels.Panel2:956:12)
                  25.11.2023, 19:11:24.788	[error]: javascript.0 (1121)     at script.js.NSPanels.Panel2:977:1
                  25.11.2023, 19:11:24.790	[error]: javascript.0 (1121) script.js.NSPanels.Panel2: Error: Cannot find module 'dayjs/locale/vi'
                  25.11.2023, 19:11:24.791	[error]: javascript.0 (1121)     at script.js.NSPanels.Panel2:966:21
                  25.11.2023, 19:11:24.791	[error]: javascript.0 (1121)     at step (script.js.NSPanels.Panel2:33:23)
                  25.11.2023, 19:11:24.791	[error]: javascript.0 (1121)     at Object.next (script.js.NSPanels.Panel2:14:53)
                  25.11.2023, 19:11:24.791	[error]: javascript.0 (1121)     at script.js.NSPanels.Panel2:8:71
                  25.11.2023, 19:11:24.792	[error]: javascript.0 (1121)     at __awaiter (script.js.NSPanels.Panel2:4:12)
                  25.11.2023, 19:11:24.792	[error]: javascript.0 (1121)     at Init_dayjs (script.js.NSPanels.Panel2:956:12)
                  25.11.2023, 19:11:24.792	[error]: javascript.0 (1121)     at script.js.NSPanels.Panel2:977:1
                  25.11.2023, 19:11:24.794	[error]: javascript.0 (1121) script.js.NSPanels.Panel2: Error: Cannot find module 'dayjs/locale/zh-cn'
                  25.11.2023, 19:11:24.796	[error]: javascript.0 (1121)     at script.js.NSPanels.Panel2:966:21
                  25.11.2023, 19:11:24.796	[error]: javascript.0 (1121)     at step (script.js.NSPanels.Panel2:33:23)
                  25.11.2023, 19:11:24.797	[error]: javascript.0 (1121)     at Object.next (script.js.NSPanels.Panel2:14:53)
                  25.11.2023, 19:11:24.797	[error]: javascript.0 (1121)     at script.js.NSPanels.Panel2:8:71
                  25.11.2023, 19:11:24.798	[error]: javascript.0 (1121)     at __awaiter (script.js.NSPanels.Panel2:4:12)
                  25.11.2023, 19:11:24.798	[error]: javascript.0 (1121)     at Init_dayjs (script.js.NSPanels.Panel2:956:12)
                  25.11.2023, 19:11:24.798	[error]: javascript.0 (1121)     at script.js.NSPanels.Panel2:977:1
                  25.11.2023, 19:11:24.801	[error]: javascript.0 (1121) script.js.NSPanels.Panel2: Error: Cannot find module 'dayjs/locale/zh-tw'
                  25.11.2023, 19:11:24.803	[error]: javascript.0 (1121)     at script.js.NSPanels.Panel2:966:21
                  25.11.2023, 19:11:24.803	[error]: javascript.0 (1121)     at step (script.js.NSPanels.Panel2:33:23)
                  25.11.2023, 19:11:24.804	[error]: javascript.0 (1121)     at Object.next (script.js.NSPanels.Panel2:14:53)
                  25.11.2023, 19:11:24.804	[error]: javascript.0 (1121)     at script.js.NSPanels.Panel2:8:71
                  25.11.2023, 19:11:24.804	[error]: javascript.0 (1121)     at __awaiter (script.js.NSPanels.Panel2:4:12)
                  25.11.2023, 19:11:24.805	[error]: javascript.0 (1121)     at Init_dayjs (script.js.NSPanels.Panel2:956:12)
                  25.11.2023, 19:11:24.805	[error]: javascript.0 (1121)     at script.js.NSPanels.Panel2:977:1
                  25.11.2023, 19:11:24.806	[warn ]: javascript.0 (1121) script.js.NSPanels.Panel2: error at function init_dayjs: Cannot read properties of undefined (reading 'locale')
                  25.11.2023, 19:11:24.842	[info ]: javascript.0 (1121) script.js.NSPanels.Panel2: setObjects enabled - create Alias Channels possible
                  25.11.2023, 19:11:24.872	[info ]: javascript.0 (1121) script.js.NSPanels.Panel2: weather alias for accuweather.0. already exists
                  25.11.2023, 19:11:25.028	[info ]: javascript.0 (1121) script.js.NSPanels.Panel2: registered 30 subscriptions, 7 schedules, 0 messages, 0 logs and 0 file subscriptions
                  25.11.2023, 19:11:25.672	[info ]: javascript.0 (1121) script.js.NSPanels.Panel2: Desired TFT Firmware: 53 / v4.3.3
                  25.11.2023, 19:11:25.673	[info ]: javascript.0 (1121) script.js.NSPanels.Panel2: Installed TFT Firmware: 53 / v4.3.3
                  25.11.2023, 19:11:25.864	[info ]: javascript.0 (1121) script.js.NSPanels.Panel2: Debugmodus deaktiviert
                  25.11.2023, 19:11:26.723	[warn ]: javascript.0 (1121)     at script.js.NSPanels.Panel2:3161:46
                  25.11.2023, 19:11:26.724	[warn ]: javascript.0 (1121)     at step (script.js.NSPanels.Panel2:33:23)
                  25.11.2023, 19:11:26.725	[warn ]: javascript.0 (1121)     at Object.next (script.js.NSPanels.Panel2:14:53)
                  25.11.2023, 19:11:26.726	[warn ]: javascript.0 (1121)     at fulfilled (script.js.NSPanels.Panel2:5:58)
                  25.11.2023, 19:11:29.569	[info ]: javascript.0 (1121) script.js.NSPanels.Panel2: Start MQTT-Port-Check -------------------------------------
                  25.11.2023, 19:11:29.570	[info ]: javascript.0 (1121) script.js.NSPanels.Panel2: -- admin.0                   - 8081
                  25.11.2023, 19:11:29.570	[info ]: javascript.0 (1121) script.js.NSPanels.Panel2: -- hm-rpc.1                  - 1200
                  25.11.2023, 19:11:29.571	[info ]: javascript.0 (1121) script.js.NSPanels.Panel2: -- mqtt.0                    - 1880
                  25.11.2023, 19:11:29.571	[info ]: javascript.0 (1121) script.js.NSPanels.Panel2: -- sonoff.0                  - 1883
                  25.11.2023, 19:11:29.571	[info ]: javascript.0 (1121) script.js.NSPanels.Panel2: -- web.0                     - 8082
                  25.11.2023, 19:11:29.572	[info ]: javascript.0 (1121) script.js.NSPanels.Panel2: - MQTT-Port-Check OK: Instance of Adapter: mqtt.0 is running on Port:1880
                  25.11.2023, 19:11:29.572	[info ]: javascript.0 (1121) script.js.NSPanels.Panel2: End MQTT-Port-Check ---------------------------------------
                  25.11.2023, 19:11:36.457	[warn ]: javascript.0 (1121) script.js.NSPanels.Panel2: error at function HandleScreensaverUpdate: parseFormat is not a function
                  25.11.2023, 19:12:00.066	[warn ]: javascript.0 (1121) script.js.NSPanels.Panel2: error at function HandleScreensaverUpdate: parseFormat is not a function
                  

                  Fehler iobroker logs. Den Screensaver habe ich bisher noch nicht angepasst. Ist das original aus dem Script
                  javascript.0 2023-11-25 19:38:30.021 warn script.js.NSPanels.Panel2: error at function HandleScreensaverUpdate: parseFormat is not a function

                  ArmilarA 1 Antwort Letzte Antwort
                  0
                  • jayjojaysonJ jayjojayson

                    @armilar @Gargano

                    Ich habe jetzt die Updates soweit vorgenommen. Der TFT Treiber und der Berry Treiber wurden auf die neuste Version gebracht. (edit: Tasmota ist weiterhin auf 12.2.0.)
                    Im Anschluss habe ich das neuste Script geladen/kopiert und als neues script im javascript modul angelegt. Die ersten grünen Zeilen aus dem script habe ich entsprechend beachtet und meine eigenen Seiten angepasst so dass sie gelesen werden können.

                    Jetzt funktioniert das Panel schon einmal wieder und ich kann meine Seiten auch bedienen. Trotzdem erhalte ich noch folgenden Fehler. Er findet irgendein Modul nicht. Unter dem javascript adapter habe ich aber moment und moment-parseformat eingestellt. Könnt ihr mir vielleicht sagen woran das liegt?

                    Screenshot 2023-11-25 192018.png

                    25.11.2023, 19:03:57.598	[info ]: javascript.0 (496) script.js.NSPanels.Panel2: compiling TypeScript source...
                    25.11.2023, 19:03:59.190	[info ]: javascript.0 (496) script.js.NSPanels.Panel2: source code did not change, using cached compilation result...
                    25.11.2023, 19:03:59.427	[error]: javascript.0 (496) script.js.NSPanels.Panel2: Error: Cannot find module 'dayjs'
                    25.11.2023, 19:03:59.429	[error]: javascript.0 (496)     at script.js.NSPanels.Panel2:951:13
                    25.11.2023, 19:03:59.432	[error]: javascript.0 (496) script.js.NSPanels.Panel2: Error: Cannot find module 'moment-parseformat'
                    25.11.2023, 19:03:59.433	[error]: javascript.0 (496)     at script.js.NSPanels.Panel2:953:19
                    25.11.2023, 19:03:59.439	[error]: javascript.0 (496) script.js.NSPanels.Panel2: Error: Cannot find module 'dayjs'
                    25.11.2023, 19:03:59.441	[error]: javascript.0 (496)     at script.js.NSPanels.Panel2:960:27
                    25.11.2023, 19:03:59.441	[error]: javascript.0 (496)     at step (script.js.NSPanels.Panel2:33:23)
                    25.11.2023, 19:03:59.441	[error]: javascript.0 (496)     at Object.next (script.js.NSPanels.Panel2:14:53)
                    25.11.2023, 19:03:59.442	[error]: javascript.0 (496)     at script.js.NSPanels.Panel2:8:71
                    25.11.2023, 19:03:59.442	[error]: javascript.0 (496)     at __awaiter (script.js.NSPanels.Panel2:4:12)
                    25.11.2023, 19:03:59.443	[error]: javascript.0 (496)     at Init_dayjs (script.js.NSPanels.Panel2:956:12)
                    25.11.2023, 19:03:59.443	[error]: javascript.0 (496)     at script.js.NSPanels.Panel2:977:1
                    25.11.2023, 19:03:59.445	[error]: javascript.0 (496) script.js.NSPanels.Panel2: Error: Cannot find module 'dayjs/locale/en'
                    25.11.2023, 19:03:59.447	[error]: javascript.0 (496)     at script.js.NSPanels.Panel2:966:21
                    25.11.2023, 19:03:59.447	[error]: javascript.0 (496)     at step (script.js.NSPanels.Panel2:33:23)
                    25.11.2023, 19:03:59.447	[error]: javascript.0 (496)     at Object.next (script.js.NSPanels.Panel2:14:53)
                    25.11.2023, 19:03:59.448	[error]: javascript.0 (496)     at script.js.NSPanels.Panel2:8:71
                    25.11.2023, 19:03:59.448	[error]: javascript.0 (496)     at __awaiter (script.js.NSPanels.Panel2:4:12)
                    25.11.2023, 19:03:59.448	[error]: javascript.0 (496)     at Init_dayjs (script.js.NSPanels.Panel2:956:12)
                    25.11.2023, 19:03:59.449	[error]: javascript.0 (496)     at script.js.NSPanels.Panel2:977:1
                    25.11.2023, 19:03:59.450	[error]: javascript.0 (496) script.js.NSPanels.Panel2: Error: Cannot find module 'dayjs/locale/de'
                    25.11.2023, 19:03:59.451	[error]: javascript.0 (496)     at script.js.NSPanels.Panel2:966:21
                    25.11.2023, 19:03:59.452	[error]: javascript.0 (496)     at step (script.js.NSPanels.Panel2:33:23)
                    25.11.2023, 19:03:59.452	[error]: javascript.0 (496)     at Object.next (script.js.NSPanels.Panel2:14:53)
                    25.11.2023, 19:03:59.452	[error]: javascript.0 (496)     at script.js.NSPanels.Panel2:8:71
                    25.11.2023, 19:03:59.453	[error]: javascript.0 (496)     at __awaiter (script.js.NSPanels.Panel2:4:12)
                    25.11.2023, 19:03:59.453	[error]: javascript.0 (496)     at Init_dayjs (script.js.NSPanels.Panel2:956:12)
                    25.11.2023, 19:03:59.453	[error]: javascript.0 (496)     at script.js.NSPanels.Panel2:977:1
                    25.11.2023, 19:03:59.455	[error]: javascript.0 (496) script.js.NSPanels.Panel2: Error: Cannot find module 'dayjs/locale/nl'
                    25.11.2023, 19:03:59.456	[error]: javascript.0 (496)     at script.js.NSPanels.Panel2:966:21
                    25.11.2023, 19:03:59.456	[error]: javascript.0 (496)     at step (script.js.NSPanels.Panel2:33:23)
                    25.11.2023, 19:03:59.456	[error]: javascript.0 (496)     at Object.next (script.js.NSPanels.Panel2:14:53)
                    25.11.2023, 19:03:59.457	[error]: javascript.0 (496)     at script.js.NSPanels.Panel2:8:71
                    25.11.2023, 19:03:59.457	[error]: javascript.0 (496)     at __awaiter (script.js.NSPanels.Panel2:4:12)
                    25.11.2023, 19:03:59.457	[error]: javascript.0 (496)     at Init_dayjs (script.js.NSPanels.Panel2:956:12)
                    25.11.2023, 19:03:59.458	[error]: javascript.0 (496)     at script.js.NSPanels.Panel2:977:1
                    25.11.2023, 19:03:59.459	[error]: javascript.0 (496) script.js.NSPanels.Panel2: Error: Cannot find module 'dayjs/locale/da'
                    25.11.2023, 19:03:59.460	[error]: javascript.0 (496)     at script.js.NSPanels.Panel2:966:21
                    25.11.2023, 19:03:59.461	[error]: javascript.0 (496)     at step (script.js.NSPanels.Panel2:33:23)
                    25.11.2023, 19:03:59.461	[error]: javascript.0 (496)     at Object.next (script.js.NSPanels.Panel2:14:53)
                    25.11.2023, 19:03:59.461	[error]: javascript.0 (496)     at script.js.NSPanels.Panel2:8:71
                    25.11.2023, 19:03:59.462	[error]: javascript.0 (496)     at __awaiter (script.js.NSPanels.Panel2:4:12)
                    25.11.2023, 19:03:59.462	[error]: javascript.0 (496)     at Init_dayjs (script.js.NSPanels.Panel2:956:12)
                    25.11.2023, 19:03:59.462	[error]: javascript.0 (496)     at script.js.NSPanels.Panel2:977:1
                    25.11.2023, 19:03:59.464	[error]: javascript.0 (496) script.js.NSPanels.Panel2: Error: Cannot find module 'dayjs/locale/es'
                    25.11.2023, 19:03:59.465	[error]: javascript.0 (496)     at script.js.NSPanels.Panel2:966:21
                    25.11.2023, 19:03:59.465	[error]: javascript.0 (496)     at step (script.js.NSPanels.Panel2:33:23)
                    25.11.2023, 19:03:59.465	[error]: javascript.0 (496)     at Object.next (script.js.NSPanels.Panel2:14:53)
                    25.11.2023, 19:03:59.466	[error]: javascript.0 (496)     at script.js.NSPanels.Panel2:8:71
                    25.11.2023, 19:03:59.466	[error]: javascript.0 (496)     at __awaiter (script.js.NSPanels.Panel2:4:12)
                    25.11.2023, 19:03:59.466	[error]: javascript.0 (496)     at Init_dayjs (script.js.NSPanels.Panel2:956:12)
                    25.11.2023, 19:03:59.466	[error]: javascript.0 (496)     at script.js.NSPanels.Panel2:977:1
                    25.11.2023, 19:03:59.468	[error]: javascript.0 (496) script.js.NSPanels.Panel2: Error: Cannot find module 'dayjs/locale/fr'
                    25.11.2023, 19:03:59.469	[error]: javascript.0 (496)     at script.js.NSPanels.Panel2:966:21
                    25.11.2023, 19:03:59.470	[error]: javascript.0 (496)     at step (script.js.NSPanels.Panel2:33:23)
                    25.11.2023, 19:03:59.470	[error]: javascript.0 (496)     at Object.next (script.js.NSPanels.Panel2:14:53)
                    25.11.2023, 19:03:59.470	[error]: javascript.0 (496)     at script.js.NSPanels.Panel2:8:71
                    25.11.2023, 19:03:59.470	[error]: javascript.0 (496)     at __awaiter (script.js.NSPanels.Panel2:4:12)
                    25.11.2023, 19:03:59.471	[error]: javascript.0 (496)     at Init_dayjs (script.js.NSPanels.Panel2:956:12)
                    25.11.2023, 19:03:59.471	[error]: javascript.0 (496)     at script.js.NSPanels.Panel2:977:1
                    25.11.2023, 19:03:59.473	[error]: javascript.0 (496) script.js.NSPanels.Panel2: Error: Cannot find module 'dayjs/locale/it'
                    25.11.2023, 19:03:59.474	[error]: javascript.0 (496)     at script.js.NSPanels.Panel2:966:21
                    25.11.2023, 19:03:59.474	[error]: javascript.0 (496)     at step (script.js.NSPanels.Panel2:33:23)
                    25.11.2023, 19:03:59.474	[error]: javascript.0 (496)     at Object.next (script.js.NSPanels.Panel2:14:53)
                    25.11.2023, 19:03:59.474	[error]: javascript.0 (496)     at script.js.NSPanels.Panel2:8:71
                    25.11.2023, 19:03:59.475	[error]: javascript.0 (496)     at __awaiter (script.js.NSPanels.Panel2:4:12)
                    25.11.2023, 19:03:59.475	[error]: javascript.0 (496)     at Init_dayjs (script.js.NSPanels.Panel2:956:12)
                    25.11.2023, 19:03:59.475	[error]: javascript.0 (496)     at script.js.NSPanels.Panel2:977:1
                    25.11.2023, 19:03:59.477	[error]: javascript.0 (496) script.js.NSPanels.Panel2: Error: Cannot find module 'dayjs/locale/ru'
                    25.11.2023, 19:03:59.478	[error]: javascript.0 (496)     at script.js.NSPanels.Panel2:966:21
                    25.11.2023, 19:03:59.479	[error]: javascript.0 (496)     at step (script.js.NSPanels.Panel2:33:23)
                    25.11.2023, 19:03:59.479	[error]: javascript.0 (496)     at Object.next (script.js.NSPanels.Panel2:14:53)
                    25.11.2023, 19:03:59.479	[error]: javascript.0 (496)     at script.js.NSPanels.Panel2:8:71
                    25.11.2023, 19:03:59.479	[error]: javascript.0 (496)     at __awaiter (script.js.NSPanels.Panel2:4:12)
                    25.11.2023, 19:03:59.480	[error]: javascript.0 (496)     at Init_dayjs (script.js.NSPanels.Panel2:956:12)
                    25.11.2023, 19:03:59.480	[error]: javascript.0 (496)     at script.js.NSPanels.Panel2:977:1
                    25.11.2023, 19:03:59.482	[error]: javascript.0 (496) script.js.NSPanels.Panel2: Error: Cannot find module 'dayjs/locale/nb'
                    25.11.2023, 19:03:59.483	[error]: javascript.0 (496)     at script.js.NSPanels.Panel2:966:21
                    25.11.2023, 19:03:59.483	[error]: javascript.0 (496)     at step (script.js.NSPanels.Panel2:33:23)
                    25.11.2023, 19:03:59.483	[error]: javascript.0 (496)     at Object.next (script.js.NSPanels.Panel2:14:53)
                    25.11.2023, 19:03:59.483	[error]: javascript.0 (496)     at script.js.NSPanels.Panel2:8:71
                    25.11.2023, 19:03:59.484	[error]: javascript.0 (496)     at __awaiter (script.js.NSPanels.Panel2:4:12)
                    25.11.2023, 19:03:59.484	[error]: javascript.0 (496)     at Init_dayjs (script.js.NSPanels.Panel2:956:12)
                    25.11.2023, 19:03:59.484	[error]: javascript.0 (496)     at script.js.NSPanels.Panel2:977:1
                    25.11.2023, 19:03:59.486	[error]: javascript.0 (496) script.js.NSPanels.Panel2: Error: Cannot find module 'dayjs/locale/nn'
                    25.11.2023, 19:03:59.487	[error]: javascript.0 (496)     at script.js.NSPanels.Panel2:966:21
                    25.11.2023, 19:03:59.487	[error]: javascript.0 (496)     at step (script.js.NSPanels.Panel2:33:23)
                    25.11.2023, 19:03:59.488	[error]: javascript.0 (496)     at Object.next (script.js.NSPanels.Panel2:14:53)
                    25.11.2023, 19:03:59.488	[error]: javascript.0 (496)     at script.js.NSPanels.Panel2:8:71
                    25.11.2023, 19:03:59.488	[error]: javascript.0 (496)     at __awaiter (script.js.NSPanels.Panel2:4:12)
                    25.11.2023, 19:03:59.488	[error]: javascript.0 (496)     at Init_dayjs (script.js.NSPanels.Panel2:956:12)
                    25.11.2023, 19:03:59.489	[error]: javascript.0 (496)     at script.js.NSPanels.Panel2:977:1
                    25.11.2023, 19:03:59.491	[error]: javascript.0 (496) script.js.NSPanels.Panel2: Error: Cannot find module 'dayjs/locale/pl'
                    25.11.2023, 19:03:59.492	[error]: javascript.0 (496)     at script.js.NSPanels.Panel2:966:21
                    25.11.2023, 19:03:59.492	[error]: javascript.0 (496)     at step (script.js.NSPanels.Panel2:33:23)
                    25.11.2023, 19:03:59.492	[error]: javascript.0 (496)     at Object.next (script.js.NSPanels.Panel2:14:53)
                    25.11.2023, 19:03:59.492	[error]: javascript.0 (496)     at script.js.NSPanels.Panel2:8:71
                    25.11.2023, 19:03:59.493	[error]: javascript.0 (496)     at __awaiter (script.js.NSPanels.Panel2:4:12)
                    25.11.2023, 19:03:59.493	[error]: javascript.0 (496)     at Init_dayjs (script.js.NSPanels.Panel2:956:12)
                    25.11.2023, 19:03:59.493	[error]: javascript.0 (496)     at script.js.NSPanels.Panel2:977:1
                    25.11.2023, 19:03:59.495	[error]: javascript.0 (496) script.js.NSPanels.Panel2: Error: Cannot find module 'dayjs/locale/pt'
                    25.11.2023, 19:03:59.496	[error]: javascript.0 (496)     at script.js.NSPanels.Panel2:966:21
                    25.11.2023, 19:03:59.496	[error]: javascript.0 (496)     at step (script.js.NSPanels.Panel2:33:23)
                    25.11.2023, 19:03:59.496	[error]: javascript.0 (496)     at Object.next (script.js.NSPanels.Panel2:14:53)
                    25.11.2023, 19:03:59.497	[error]: javascript.0 (496)     at script.js.NSPanels.Panel2:8:71
                    25.11.2023, 19:03:59.497	[error]: javascript.0 (496)     at __awaiter (script.js.NSPanels.Panel2:4:12)
                    25.11.2023, 19:03:59.497	[error]: javascript.0 (496)     at Init_dayjs (script.js.NSPanels.Panel2:956:12)
                    25.11.2023, 19:03:59.498	[error]: javascript.0 (496)     at script.js.NSPanels.Panel2:977:1
                    25.11.2023, 19:03:59.499	[error]: javascript.0 (496) script.js.NSPanels.Panel2: Error: Cannot find module 'dayjs/locale/af'
                    25.11.2023, 19:03:59.501	[error]: javascript.0 (496)     at script.js.NSPanels.Panel2:966:21
                    25.11.2023, 19:03:59.501	[error]: javascript.0 (496)     at step (script.js.NSPanels.Panel2:33:23)
                    25.11.2023, 19:03:59.501	[error]: javascript.0 (496)     at Object.next (script.js.NSPanels.Panel2:14:53)
                    25.11.2023, 19:03:59.501	[error]: javascript.0 (496)     at script.js.NSPanels.Panel2:8:71
                    25.11.2023, 19:03:59.502	[error]: javascript.0 (496)     at __awaiter (script.js.NSPanels.Panel2:4:12)
                    25.11.2023, 19:03:59.502	[error]: javascript.0 (496)     at Init_dayjs (script.js.NSPanels.Panel2:956:12)
                    25.11.2023, 19:03:59.502	[error]: javascript.0 (496)     at script.js.NSPanels.Panel2:977:1
                    25.11.2023, 19:03:59.510	[error]: javascript.0 (496) script.js.NSPanels.Panel2: Error: Cannot find module 'dayjs/locale/ar'
                    25.11.2023, 19:03:59.512	[error]: javascript.0 (496)     at script.js.NSPanels.Panel2:966:21
                    25.11.2023, 19:03:59.512	[error]: javascript.0 (496)     at step (script.js.NSPanels.Panel2:33:23)
                    25.11.2023, 19:03:59.512	[error]: javascript.0 (496)     at Object.next (script.js.NSPanels.Panel2:14:53)
                    25.11.2023, 19:03:59.513	[error]: javascript.0 (496)     at script.js.NSPanels.Panel2:8:71
                    25.11.2023, 19:03:59.513	[error]: javascript.0 (496)     at __awaiter (script.js.NSPanels.Panel2:4:12)
                    25.11.2023, 19:03:59.513	[error]: javascript.0 (496)     at Init_dayjs (script.js.NSPanels.Panel2:956:12)
                    25.11.2023, 19:03:59.514	[error]: javascript.0 (496)     at script.js.NSPanels.Panel2:977:1
                    25.11.2023, 19:03:59.515	[error]: javascript.0 (496) script.js.NSPanels.Panel2: Error: Cannot find module 'dayjs/locale/bg'
                    25.11.2023, 19:03:59.516	[error]: javascript.0 (496)     at script.js.NSPanels.Panel2:966:21
                    25.11.2023, 19:03:59.517	[error]: javascript.0 (496)     at step (script.js.NSPanels.Panel2:33:23)
                    25.11.2023, 19:03:59.517	[error]: javascript.0 (496)     at Object.next (script.js.NSPanels.Panel2:14:53)
                    25.11.2023, 19:03:59.517	[error]: javascript.0 (496)     at script.js.NSPanels.Panel2:8:71
                    25.11.2023, 19:03:59.517	[error]: javascript.0 (496)     at __awaiter (script.js.NSPanels.Panel2:4:12)
                    25.11.2023, 19:03:59.518	[error]: javascript.0 (496)     at Init_dayjs (script.js.NSPanels.Panel2:956:12)
                    25.11.2023, 19:03:59.518	[error]: javascript.0 (496)     at script.js.NSPanels.Panel2:977:1
                    25.11.2023, 19:03:59.520	[error]: javascript.0 (496) script.js.NSPanels.Panel2: Error: Cannot find module 'dayjs/locale/ca'
                    25.11.2023, 19:03:59.521	[error]: javascript.0 (496)     at script.js.NSPanels.Panel2:966:21
                    25.11.2023, 19:03:59.521	[error]: javascript.0 (496)     at step (script.js.NSPanels.Panel2:33:23)
                    25.11.2023, 19:03:59.521	[error]: javascript.0 (496)     at Object.next (script.js.NSPanels.Panel2:14:53)
                    25.11.2023, 19:03:59.521	[error]: javascript.0 (496)     at script.js.NSPanels.Panel2:8:71
                    25.11.2023, 19:03:59.522	[error]: javascript.0 (496)     at __awaiter (script.js.NSPanels.Panel2:4:12)
                    25.11.2023, 19:03:59.522	[error]: javascript.0 (496)     at Init_dayjs (script.js.NSPanels.Panel2:956:12)
                    25.11.2023, 19:03:59.522	[error]: javascript.0 (496)     at script.js.NSPanels.Panel2:977:1
                    25.11.2023, 19:03:59.524	[error]: javascript.0 (496) script.js.NSPanels.Panel2: Error: Cannot find module 'dayjs/locale/cs'
                    25.11.2023, 19:03:59.525	[error]: javascript.0 (496)     at script.js.NSPanels.Panel2:966:21
                    25.11.2023, 19:03:59.525	[error]: javascript.0 (496)     at step (script.js.NSPanels.Panel2:33:23)
                    25.11.2023, 19:03:59.525	[error]: javascript.0 (496)     at Object.next (script.js.NSPanels.Panel2:14:53)
                    25.11.2023, 19:03:59.525	[error]: javascript.0 (496)     at script.js.NSPanels.Panel2:8:71
                    25.11.2023, 19:03:59.526	[error]: javascript.0 (496)     at __awaiter (script.js.NSPanels.Panel2:4:12)
                    25.11.2023, 19:03:59.526	[error]: javascript.0 (496)     at Init_dayjs (script.js.NSPanels.Panel2:956:12)
                    25.11.2023, 19:03:59.526	[error]: javascript.0 (496)     at script.js.NSPanels.Panel2:977:1
                    25.11.2023, 19:03:59.528	[error]: javascript.0 (496) script.js.NSPanels.Panel2: Error: Cannot find module 'dayjs/locale/el'
                    25.11.2023, 19:03:59.529	[error]: javascript.0 (496)     at script.js.NSPanels.Panel2:966:21
                    25.11.2023, 19:03:59.529	[error]: javascript.0 (496)     at step (script.js.NSPanels.Panel2:33:23)
                    25.11.2023, 19:03:59.529	[error]: javascript.0 (496)     at Object.next (script.js.NSPanels.Panel2:14:53)
                    25.11.2023, 19:03:59.529	[error]: javascript.0 (496)     at script.js.NSPanels.Panel2:8:71
                    25.11.2023, 19:03:59.530	[error]: javascript.0 (496)     at __awaiter (script.js.NSPanels.Panel2:4:12)
                    25.11.2023, 19:03:59.530	[error]: javascript.0 (496)     at Init_dayjs (script.js.NSPanels.Panel2:956:12)
                    25.11.2023, 19:03:59.530	[error]: javascript.0 (496)     at script.js.NSPanels.Panel2:977:1
                    25.11.2023, 19:03:59.532	[error]: javascript.0 (496) script.js.NSPanels.Panel2: Error: Cannot find module 'dayjs/locale/et'
                    25.11.2023, 19:03:59.535	[error]: javascript.0 (496)     at script.js.NSPanels.Panel2:966:21
                    25.11.2023, 19:03:59.535	[error]: javascript.0 (496)     at step (script.js.NSPanels.Panel2:33:23)
                    25.11.2023, 19:03:59.535	[error]: javascript.0 (496)     at Object.next (script.js.NSPanels.Panel2:14:53)
                    25.11.2023, 19:03:59.535	[error]: javascript.0 (496)     at script.js.NSPanels.Panel2:8:71
                    25.11.2023, 19:03:59.536	[error]: javascript.0 (496)     at __awaiter (script.js.NSPanels.Panel2:4:12)
                    25.11.2023, 19:03:59.536	[error]: javascript.0 (496)     at Init_dayjs (script.js.NSPanels.Panel2:956:12)
                    25.11.2023, 19:03:59.536	[error]: javascript.0 (496)     at script.js.NSPanels.Panel2:977:1
                    25.11.2023, 19:03:59.538	[error]: javascript.0 (496) script.js.NSPanels.Panel2: Error: Cannot find module 'dayjs/locale/fa'
                    25.11.2023, 19:03:59.539	[error]: javascript.0 (496)     at script.js.NSPanels.Panel2:966:21
                    25.11.2023, 19:03:59.540	[error]: javascript.0 (496)     at step (script.js.NSPanels.Panel2:33:23)
                    25.11.2023, 19:03:59.540	[error]: javascript.0 (496)     at Object.next (script.js.NSPanels.Panel2:14:53)
                    25.11.2023, 19:03:59.540	[error]: javascript.0 (496)     at script.js.NSPanels.Panel2:8:71
                    25.11.2023, 19:03:59.540	[error]: javascript.0 (496)     at __awaiter (script.js.NSPanels.Panel2:4:12)
                    25.11.2023, 19:03:59.540	[error]: javascript.0 (496)     at Init_dayjs (script.js.NSPanels.Panel2:956:12)
                    25.11.2023, 19:03:59.541	[error]: javascript.0 (496)     at script.js.NSPanels.Panel2:977:1
                    25.11.2023, 19:03:59.550	[error]: javascript.0 (496) script.js.NSPanels.Panel2: Error: Cannot find module 'dayjs/locale/fi'
                    25.11.2023, 19:03:59.551	[error]: javascript.0 (496)     at script.js.NSPanels.Panel2:966:21
                    25.11.2023, 19:03:59.551	[error]: javascript.0 (496)     at step (script.js.NSPanels.Panel2:33:23)
                    25.11.2023, 19:03:59.552	[error]: javascript.0 (496)     at Object.next (script.js.NSPanels.Panel2:14:53)
                    25.11.2023, 19:03:59.552	[error]: javascript.0 (496)     at script.js.NSPanels.Panel2:8:71
                    25.11.2023, 19:03:59.552	[error]: javascript.0 (496)     at __awaiter (script.js.NSPanels.Panel2:4:12)
                    25.11.2023, 19:03:59.552	[error]: javascript.0 (496)     at Init_dayjs (script.js.NSPanels.Panel2:956:12)
                    25.11.2023, 19:03:59.553	[error]: javascript.0 (496)     at script.js.NSPanels.Panel2:977:1
                    25.11.2023, 19:03:59.554	[error]: javascript.0 (496) script.js.NSPanels.Panel2: Error: Cannot find module 'dayjs/locale/he'
                    25.11.2023, 19:03:59.555	[error]: javascript.0 (496)     at script.js.NSPanels.Panel2:966:21
                    25.11.2023, 19:03:59.555	[error]: javascript.0 (496)     at step (script.js.NSPanels.Panel2:33:23)
                    25.11.2023, 19:03:59.556	[error]: javascript.0 (496)     at Object.next (script.js.NSPanels.Panel2:14:53)
                    25.11.2023, 19:03:59.556	[error]: javascript.0 (496)     at script.js.NSPanels.Panel2:8:71
                    25.11.2023, 19:03:59.556	[error]: javascript.0 (496)     at __awaiter (script.js.NSPanels.Panel2:4:12)
                    25.11.2023, 19:03:59.556	[error]: javascript.0 (496)     at Init_dayjs (script.js.NSPanels.Panel2:956:12)
                    25.11.2023, 19:03:59.556	[error]: javascript.0 (496)     at script.js.NSPanels.Panel2:977:1
                    25.11.2023, 19:03:59.558	[error]: javascript.0 (496) script.js.NSPanels.Panel2: Error: Cannot find module 'dayjs/locale/hr'
                    25.11.2023, 19:03:59.559	[error]: javascript.0 (496)     at script.js.NSPanels.Panel2:966:21
                    25.11.2023, 19:03:59.559	[error]: javascript.0 (496)     at step (script.js.NSPanels.Panel2:33:23)
                    25.11.2023, 19:03:59.560	[error]: javascript.0 (496)     at Object.next (script.js.NSPanels.Panel2:14:53)
                    25.11.2023, 19:03:59.560	[error]: javascript.0 (496)     at script.js.NSPanels.Panel2:8:71
                    25.11.2023, 19:03:59.560	[error]: javascript.0 (496)     at __awaiter (script.js.NSPanels.Panel2:4:12)
                    25.11.2023, 19:03:59.560	[error]: javascript.0 (496)     at Init_dayjs (script.js.NSPanels.Panel2:956:12)
                    25.11.2023, 19:03:59.560	[error]: javascript.0 (496)     at script.js.NSPanels.Panel2:977:1
                    25.11.2023, 19:03:59.562	[error]: javascript.0 (496) script.js.NSPanels.Panel2: Error: Cannot find module 'dayjs/locale/hu'
                    25.11.2023, 19:03:59.563	[error]: javascript.0 (496)     at script.js.NSPanels.Panel2:966:21
                    25.11.2023, 19:03:59.563	[error]: javascript.0 (496)     at step (script.js.NSPanels.Panel2:33:23)
                    25.11.2023, 19:03:59.563	[error]: javascript.0 (496)     at Object.next (script.js.NSPanels.Panel2:14:53)
                    25.11.2023, 19:03:59.564	[error]: javascript.0 (496)     at script.js.NSPanels.Panel2:8:71
                    25.11.2023, 19:03:59.564	[error]: javascript.0 (496)     at __awaiter (script.js.NSPanels.Panel2:4:12)
                    25.11.2023, 19:03:59.564	[error]: javascript.0 (496)     at Init_dayjs (script.js.NSPanels.Panel2:956:12)
                    25.11.2023, 19:03:59.565	[error]: javascript.0 (496)     at script.js.NSPanels.Panel2:977:1
                    25.11.2023, 19:03:59.568	[error]: javascript.0 (496) script.js.NSPanels.Panel2: Error: Cannot find module 'dayjs/locale/hy-am'
                    25.11.2023, 19:03:59.569	[error]: javascript.0 (496)     at script.js.NSPanels.Panel2:966:21
                    25.11.2023, 19:03:59.570	[error]: javascript.0 (496)     at step (script.js.NSPanels.Panel2:33:23)
                    25.11.2023, 19:03:59.570	[error]: javascript.0 (496)     at Object.next (script.js.NSPanels.Panel2:14:53)
                    25.11.2023, 19:03:59.570	[error]: javascript.0 (496)     at script.js.NSPanels.Panel2:8:71
                    25.11.2023, 19:03:59.571	[error]: javascript.0 (496)     at __awaiter (script.js.NSPanels.Panel2:4:12)
                    25.11.2023, 19:03:59.571	[error]: javascript.0 (496)     at Init_dayjs (script.js.NSPanels.Panel2:956:12)
                    25.11.2023, 19:03:59.571	[error]: javascript.0 (496)     at script.js.NSPanels.Panel2:977:1
                    25.11.2023, 19:03:59.573	[error]: javascript.0 (496) script.js.NSPanels.Panel2: Error: Cannot find module 'dayjs/locale/id'
                    25.11.2023, 19:03:59.574	[error]: javascript.0 (496)     at script.js.NSPanels.Panel2:966:21
                    25.11.2023, 19:03:59.574	[error]: javascript.0 (496)     at step (script.js.NSPanels.Panel2:33:23)
                    25.11.2023, 19:03:59.574	[error]: javascript.0 (496)     at Object.next (script.js.NSPanels.Panel2:14:53)
                    25.11.2023, 19:03:59.574	[error]: javascript.0 (496)     at script.js.NSPanels.Panel2:8:71
                    25.11.2023, 19:03:59.574	[error]: javascript.0 (496)     at __awaiter (script.js.NSPanels.Panel2:4:12)
                    25.11.2023, 19:03:59.575	[error]: javascript.0 (496)     at Init_dayjs (script.js.NSPanels.Panel2:956:12)
                    25.11.2023, 19:03:59.575	[error]: javascript.0 (496)     at script.js.NSPanels.Panel2:977:1
                    25.11.2023, 19:03:59.577	[error]: javascript.0 (496) script.js.NSPanels.Panel2: Error: Cannot find module 'dayjs/locale/is'
                    25.11.2023, 19:03:59.578	[error]: javascript.0 (496)     at script.js.NSPanels.Panel2:966:21
                    25.11.2023, 19:03:59.578	[error]: javascript.0 (496)     at step (script.js.NSPanels.Panel2:33:23)
                    25.11.2023, 19:03:59.578	[error]: javascript.0 (496)     at Object.next (script.js.NSPanels.Panel2:14:53)
                    25.11.2023, 19:03:59.579	[error]: javascript.0 (496)     at script.js.NSPanels.Panel2:8:71
                    25.11.2023, 19:03:59.579	[error]: javascript.0 (496)     at __awaiter (script.js.NSPanels.Panel2:4:12)
                    25.11.2023, 19:03:59.579	[error]: javascript.0 (496)     at Init_dayjs (script.js.NSPanels.Panel2:956:12)
                    25.11.2023, 19:03:59.579	[error]: javascript.0 (496)     at script.js.NSPanels.Panel2:977:1
                    25.11.2023, 19:03:59.581	[error]: javascript.0 (496) script.js.NSPanels.Panel2: Error: Cannot find module 'dayjs/locale/lb'
                    25.11.2023, 19:03:59.582	[error]: javascript.0 (496)     at script.js.NSPanels.Panel2:966:21
                    25.11.2023, 19:03:59.582	[error]: javascript.0 (496)     at step (script.js.NSPanels.Panel2:33:23)
                    25.11.2023, 19:03:59.582	[error]: javascript.0 (496)     at Object.next (script.js.NSPanels.Panel2:14:53)
                    25.11.2023, 19:03:59.583	[error]: javascript.0 (496)     at script.js.NSPanels.Panel2:8:71
                    25.11.2023, 19:03:59.583	[error]: javascript.0 (496)     at __awaiter (script.js.NSPanels.Panel2:4:12)
                    25.11.2023, 19:03:59.583	[error]: javascript.0 (496)     at Init_dayjs (script.js.NSPanels.Panel2:956:12)
                    25.11.2023, 19:03:59.583	[error]: javascript.0 (496)     at script.js.NSPanels.Panel2:977:1
                    25.11.2023, 19:03:59.585	[error]: javascript.0 (496) script.js.NSPanels.Panel2: Error: Cannot find module 'dayjs/locale/lt'
                    25.11.2023, 19:03:59.586	[error]: javascript.0 (496)     at script.js.NSPanels.Panel2:966:21
                    25.11.2023, 19:03:59.586	[error]: javascript.0 (496)     at step (script.js.NSPanels.Panel2:33:23)
                    25.11.2023, 19:03:59.586	[error]: javascript.0 (496)     at Object.next (script.js.NSPanels.Panel2:14:53)
                    25.11.2023, 19:03:59.586	[error]: javascript.0 (496)     at script.js.NSPanels.Panel2:8:71
                    25.11.2023, 19:03:59.587	[error]: javascript.0 (496)     at __awaiter (script.js.NSPanels.Panel2:4:12)
                    25.11.2023, 19:03:59.587	[error]: javascript.0 (496)     at Init_dayjs (script.js.NSPanels.Panel2:956:12)
                    25.11.2023, 19:03:59.587	[error]: javascript.0 (496)     at script.js.NSPanels.Panel2:977:1
                    25.11.2023, 19:03:59.589	[error]: javascript.0 (496) script.js.NSPanels.Panel2: Error: Cannot find module 'dayjs/locale/ro'
                    25.11.2023, 19:03:59.590	[error]: javascript.0 (496)     at script.js.NSPanels.Panel2:966:21
                    25.11.2023, 19:03:59.590	[error]: javascript.0 (496)     at step (script.js.NSPanels.Panel2:33:23)
                    25.11.2023, 19:03:59.590	[error]: javascript.0 (496)     at Object.next (script.js.NSPanels.Panel2:14:53)
                    25.11.2023, 19:03:59.591	[error]: javascript.0 (496)     at script.js.NSPanels.Panel2:8:71
                    25.11.2023, 19:03:59.591	[error]: javascript.0 (496)     at __awaiter (script.js.NSPanels.Panel2:4:12)
                    25.11.2023, 19:03:59.591	[error]: javascript.0 (496)     at Init_dayjs (script.js.NSPanels.Panel2:956:12)
                    25.11.2023, 19:03:59.592	[error]: javascript.0 (496)     at script.js.NSPanels.Panel2:977:1
                    25.11.2023, 19:03:59.593	[error]: javascript.0 (496) script.js.NSPanels.Panel2: Error: Cannot find module 'dayjs/locale/sk'
                    25.11.2023, 19:03:59.595	[error]: javascript.0 (496)     at script.js.NSPanels.Panel2:966:21
                    25.11.2023, 19:03:59.595	[error]: javascript.0 (496)     at step (script.js.NSPanels.Panel2:33:23)
                    25.11.2023, 19:03:59.595	[error]: javascript.0 (496)     at Object.next (script.js.NSPanels.Panel2:14:53)
                    25.11.2023, 19:03:59.596	[error]: javascript.0 (496)     at script.js.NSPanels.Panel2:8:71
                    25.11.2023, 19:03:59.596	[error]: javascript.0 (496)     at __awaiter (script.js.NSPanels.Panel2:4:12)
                    25.11.2023, 19:03:59.596	[error]: javascript.0 (496)     at Init_dayjs (script.js.NSPanels.Panel2:956:12)
                    25.11.2023, 19:03:59.596	[error]: javascript.0 (496)     at script.js.NSPanels.Panel2:977:1
                    25.11.2023, 19:03:59.598	[error]: javascript.0 (496) script.js.NSPanels.Panel2: Error: Cannot find module 'dayjs/locale/sl'
                    25.11.2023, 19:03:59.599	[error]: javascript.0 (496)     at script.js.NSPanels.Panel2:966:21
                    25.11.2023, 19:03:59.599	[error]: javascript.0 (496)     at step (script.js.NSPanels.Panel2:33:23)
                    25.11.2023, 19:03:59.599	[error]: javascript.0 (496)     at Object.next (script.js.NSPanels.Panel2:14:53)
                    25.11.2023, 19:03:59.600	[error]: javascript.0 (496)     at script.js.NSPanels.Panel2:8:71
                    25.11.2023, 19:03:59.600	[error]: javascript.0 (496)     at __awaiter (script.js.NSPanels.Panel2:4:12)
                    25.11.2023, 19:03:59.600	[error]: javascript.0 (496)     at Init_dayjs (script.js.NSPanels.Panel2:956:12)
                    25.11.2023, 19:03:59.600	[error]: javascript.0 (496)     at script.js.NSPanels.Panel2:977:1
                    25.11.2023, 19:03:59.602	[error]: javascript.0 (496) script.js.NSPanels.Panel2: Error: Cannot find module 'dayjs/locale/sv'
                    25.11.2023, 19:03:59.603	[error]: javascript.0 (496)     at script.js.NSPanels.Panel2:966:21
                    25.11.2023, 19:03:59.603	[error]: javascript.0 (496)     at step (script.js.NSPanels.Panel2:33:23)
                    25.11.2023, 19:03:59.603	[error]: javascript.0 (496)     at Object.next (script.js.NSPanels.Panel2:14:53)
                    25.11.2023, 19:03:59.603	[error]: javascript.0 (496)     at script.js.NSPanels.Panel2:8:71
                    25.11.2023, 19:03:59.604	[error]: javascript.0 (496)     at __awaiter (script.js.NSPanels.Panel2:4:12)
                    25.11.2023, 19:03:59.604	[error]: javascript.0 (496)     at Init_dayjs (script.js.NSPanels.Panel2:956:12)
                    25.11.2023, 19:03:59.604	[error]: javascript.0 (496)     at script.js.NSPanels.Panel2:977:1
                    25.11.2023, 19:03:59.606	[error]: javascript.0 (496) script.js.NSPanels.Panel2: Error: Cannot find module 'dayjs/locale/th'
                    25.11.2023, 19:03:59.607	[error]: javascript.0 (496)     at script.js.NSPanels.Panel2:966:21
                    25.11.2023, 19:03:59.607	[error]: javascript.0 (496)     at step (script.js.NSPanels.Panel2:33:23)
                    25.11.2023, 19:03:59.607	[error]: javascript.0 (496)     at Object.next (script.js.NSPanels.Panel2:14:53)
                    25.11.2023, 19:03:59.609	[error]: javascript.0 (496)     at script.js.NSPanels.Panel2:8:71
                    25.11.2023, 19:03:59.609	[error]: javascript.0 (496)     at __awaiter (script.js.NSPanels.Panel2:4:12)
                    25.11.2023, 19:03:59.610	[error]: javascript.0 (496)     at Init_dayjs (script.js.NSPanels.Panel2:956:12)
                    25.11.2023, 19:03:59.610	[error]: javascript.0 (496)     at script.js.NSPanels.Panel2:977:1
                    25.11.2023, 19:03:59.612	[error]: javascript.0 (496) script.js.NSPanels.Panel2: Error: Cannot find module 'dayjs/locale/tr'
                    25.11.2023, 19:03:59.613	[error]: javascript.0 (496)     at script.js.NSPanels.Panel2:966:21
                    25.11.2023, 19:03:59.613	[error]: javascript.0 (496)     at step (script.js.NSPanels.Panel2:33:23)
                    25.11.2023, 19:03:59.614	[error]: javascript.0 (496)     at Object.next (script.js.NSPanels.Panel2:14:53)
                    25.11.2023, 19:03:59.614	[error]: javascript.0 (496)     at script.js.NSPanels.Panel2:8:71
                    25.11.2023, 19:03:59.615	[error]: javascript.0 (496)     at __awaiter (script.js.NSPanels.Panel2:4:12)
                    25.11.2023, 19:03:59.615	[error]: javascript.0 (496)     at Init_dayjs (script.js.NSPanels.Panel2:956:12)
                    25.11.2023, 19:03:59.615	[error]: javascript.0 (496)     at script.js.NSPanels.Panel2:977:1
                    25.11.2023, 19:03:59.618	[error]: javascript.0 (496) script.js.NSPanels.Panel2: Error: Cannot find module 'dayjs/locale/uk'
                    25.11.2023, 19:03:59.619	[error]: javascript.0 (496)     at script.js.NSPanels.Panel2:966:21
                    25.11.2023, 19:03:59.619	[error]: javascript.0 (496)     at step (script.js.NSPanels.Panel2:33:23)
                    25.11.2023, 19:03:59.619	[error]: javascript.0 (496)     at Object.next (script.js.NSPanels.Panel2:14:53)
                    25.11.2023, 19:03:59.619	[error]: javascript.0 (496)     at script.js.NSPanels.Panel2:8:71
                    25.11.2023, 19:03:59.620	[error]: javascript.0 (496)     at __awaiter (script.js.NSPanels.Panel2:4:12)
                    25.11.2023, 19:03:59.620	[error]: javascript.0 (496)     at Init_dayjs (script.js.NSPanels.Panel2:956:12)
                    25.11.2023, 19:03:59.620	[error]: javascript.0 (496)     at script.js.NSPanels.Panel2:977:1
                    25.11.2023, 19:03:59.622	[error]: javascript.0 (496) script.js.NSPanels.Panel2: Error: Cannot find module 'dayjs/locale/vi'
                    25.11.2023, 19:03:59.622	[error]: javascript.0 (496)     at script.js.NSPanels.Panel2:966:21
                    25.11.2023, 19:03:59.623	[error]: javascript.0 (496)     at step (script.js.NSPanels.Panel2:33:23)
                    25.11.2023, 19:03:59.623	[error]: javascript.0 (496)     at Object.next (script.js.NSPanels.Panel2:14:53)
                    25.11.2023, 19:03:59.623	[error]: javascript.0 (496)     at script.js.NSPanels.Panel2:8:71
                    25.11.2023, 19:03:59.623	[error]: javascript.0 (496)     at __awaiter (script.js.NSPanels.Panel2:4:12)
                    25.11.2023, 19:03:59.623	[error]: javascript.0 (496)     at Init_dayjs (script.js.NSPanels.Panel2:956:12)
                    25.11.2023, 19:03:59.624	[error]: javascript.0 (496)     at script.js.NSPanels.Panel2:977:1
                    25.11.2023, 19:03:59.625	[error]: javascript.0 (496) script.js.NSPanels.Panel2: Error: Cannot find module 'dayjs/locale/zh-cn'
                    25.11.2023, 19:03:59.626	[error]: javascript.0 (496)     at script.js.NSPanels.Panel2:966:21
                    25.11.2023, 19:03:59.626	[error]: javascript.0 (496)     at step (script.js.NSPanels.Panel2:33:23)
                    25.11.2023, 19:03:59.626	[error]: javascript.0 (496)     at Object.next (script.js.NSPanels.Panel2:14:53)
                    25.11.2023, 19:03:59.626	[error]: javascript.0 (496)     at script.js.NSPanels.Panel2:8:71
                    25.11.2023, 19:03:59.627	[error]: javascript.0 (496)     at __awaiter (script.js.NSPanels.Panel2:4:12)
                    25.11.2023, 19:03:59.627	[error]: javascript.0 (496)     at Init_dayjs (script.js.NSPanels.Panel2:956:12)
                    25.11.2023, 19:03:59.627	[error]: javascript.0 (496)     at script.js.NSPanels.Panel2:977:1
                    25.11.2023, 19:03:59.629	[error]: javascript.0 (496) script.js.NSPanels.Panel2: Error: Cannot find module 'dayjs/locale/zh-tw'
                    25.11.2023, 19:03:59.630	[error]: javascript.0 (496)     at script.js.NSPanels.Panel2:966:21
                    25.11.2023, 19:03:59.630	[error]: javascript.0 (496)     at step (script.js.NSPanels.Panel2:33:23)
                    25.11.2023, 19:03:59.631	[error]: javascript.0 (496)     at Object.next (script.js.NSPanels.Panel2:14:53)
                    25.11.2023, 19:03:59.631	[error]: javascript.0 (496)     at script.js.NSPanels.Panel2:8:71
                    25.11.2023, 19:03:59.631	[error]: javascript.0 (496)     at __awaiter (script.js.NSPanels.Panel2:4:12)
                    25.11.2023, 19:03:59.631	[error]: javascript.0 (496)     at Init_dayjs (script.js.NSPanels.Panel2:956:12)
                    25.11.2023, 19:03:59.632	[error]: javascript.0 (496)     at script.js.NSPanels.Panel2:977:1
                    25.11.2023, 19:03:59.633	[warn ]: javascript.0 (496) script.js.NSPanels.Panel2: error at function init_dayjs: Cannot read properties of undefined (reading 'locale')
                    25.11.2023, 19:03:59.661	[info ]: javascript.0 (496) script.js.NSPanels.Panel2: setObjects enabled - create Alias Channels possible
                    25.11.2023, 19:03:59.676	[info ]: javascript.0 (496) script.js.NSPanels.Panel2: weather alias for accuweather.0. already exists
                    25.11.2023, 19:03:59.798	[info ]: javascript.0 (496) script.js.NSPanels.Panel2: registered 30 subscriptions, 7 schedules, 0 messages, 0 logs and 0 file subscriptions
                    25.11.2023, 19:04:00.464	[info ]: javascript.0 (496) script.js.NSPanels.Panel2: Desired TFT Firmware: 53 / v4.3.3
                    25.11.2023, 19:04:00.465	[info ]: javascript.0 (496) script.js.NSPanels.Panel2: Installed TFT Firmware: 53 / v4.3.3
                    25.11.2023, 19:04:00.583	[info ]: javascript.0 (496) script.js.NSPanels.Panel2: Debugmodus deaktiviert
                    25.11.2023, 19:04:00.587	[warn ]: javascript.0 (496) script.js.NSPanels.Panel2: error setState in function get_tasmota_status0"undefined" is not valid JSON
                    25.11.2023, 19:04:00.866	[warn ]: javascript.0 (496) script.js.NSPanels.Panel2: error result in function get_current_berry_driver_version: "undefined" is not valid JSON
                    25.11.2023, 19:04:04.016	[info ]: javascript.0 (496) script.js.NSPanels.Panel2: Start MQTT-Port-Check -------------------------------------
                    25.11.2023, 19:04:04.017	[info ]: javascript.0 (496) script.js.NSPanels.Panel2: -- admin.0                   - 8081
                    25.11.2023, 19:04:04.017	[info ]: javascript.0 (496) script.js.NSPanels.Panel2: -- hm-rpc.1                  - 1200
                    25.11.2023, 19:04:04.018	[info ]: javascript.0 (496) script.js.NSPanels.Panel2: -- mqtt.0                    - 1880
                    25.11.2023, 19:04:04.018	[info ]: javascript.0 (496) script.js.NSPanels.Panel2: -- sonoff.0                  - 1883
                    25.11.2023, 19:04:04.019	[info ]: javascript.0 (496) script.js.NSPanels.Panel2: -- web.0                     - 8082
                    25.11.2023, 19:04:04.019	[info ]: javascript.0 (496) script.js.NSPanels.Panel2: - MQTT-Port-Check OK: Instance of Adapter: mqtt.0 is running on Port:1880
                    25.11.2023, 19:04:04.020	[info ]: javascript.0 (496) script.js.NSPanels.Panel2: End MQTT-Port-Check ---------------------------------------
                    25.11.2023, 19:06:48.449	[warn ]: javascript.0 (496) script.js.NSPanels.Panel2: error at function HandleScreensaverUpdate: parseFormat is not a function
                    25.11.2023, 19:07:00.037	[warn ]: javascript.0 (496) script.js.NSPanels.Panel2: error at function HandleScreensaverUpdate: parseFormat is not a function
                    25.11.2023, 19:08:30.037	[warn ]: javascript.0 (496) script.js.NSPanels.Panel2: error at function HandleScreensaverUpdate: parseFormat is not a function
                    25.11.2023, 19:09:00.046	[warn ]: javascript.0 (496) script.js.NSPanels.Panel2: error at function HandleScreensaverUpdate: parseFormat is not a function
                    25.11.2023, 19:10:30.030	[warn ]: javascript.0 (496) script.js.NSPanels.Panel2: error at function HandleScreensaverUpdate: parseFormat is not a function
                    25.11.2023, 19:11:00.012	[warn ]: javascript.0 (496) script.js.NSPanels.Panel2: error at function HandleScreensaverUpdate: parseFormat is not a function
                    25.11.2023, 19:11:12.690	[info ]: javascript.0 (496) Stop script script.js.NSPanels.Panel2
                    25.11.2023, 19:11:22.536	[info ]: javascript.0 (1121) script.js.NSPanels.Panel2: compiling TypeScript source...
                    25.11.2023, 19:11:24.109	[info ]: javascript.0 (1121) script.js.NSPanels.Panel2: source code did not change, using cached compilation result...
                    25.11.2023, 19:11:24.519	[error]: javascript.0 (1121) script.js.NSPanels.Panel2: Error: Cannot find module 'dayjs'
                    25.11.2023, 19:11:24.523	[error]: javascript.0 (1121)     at script.js.NSPanels.Panel2:951:13
                    25.11.2023, 19:11:24.526	[error]: javascript.0 (1121) script.js.NSPanels.Panel2: Error: Cannot find module 'moment-parseformat'
                    25.11.2023, 19:11:24.528	[error]: javascript.0 (1121)     at script.js.NSPanels.Panel2:953:19
                    25.11.2023, 19:11:24.534	[error]: javascript.0 (1121) script.js.NSPanels.Panel2: Error: Cannot find module 'dayjs'
                    25.11.2023, 19:11:24.535	[error]: javascript.0 (1121)     at script.js.NSPanels.Panel2:960:27
                    25.11.2023, 19:11:24.536	[error]: javascript.0 (1121)     at step (script.js.NSPanels.Panel2:33:23)
                    25.11.2023, 19:11:24.536	[error]: javascript.0 (1121)     at Object.next (script.js.NSPanels.Panel2:14:53)
                    25.11.2023, 19:11:24.537	[error]: javascript.0 (1121)     at script.js.NSPanels.Panel2:8:71
                    25.11.2023, 19:11:24.538	[error]: javascript.0 (1121)     at __awaiter (script.js.NSPanels.Panel2:4:12)
                    25.11.2023, 19:11:24.539	[error]: javascript.0 (1121)     at Init_dayjs (script.js.NSPanels.Panel2:956:12)
                    25.11.2023, 19:11:24.539	[error]: javascript.0 (1121)     at script.js.NSPanels.Panel2:977:1
                    25.11.2023, 19:11:24.542	[error]: javascript.0 (1121) script.js.NSPanels.Panel2: Error: Cannot find module 'dayjs/locale/en'
                    25.11.2023, 19:11:24.543	[error]: javascript.0 (1121)     at script.js.NSPanels.Panel2:966:21
                    25.11.2023, 19:11:24.544	[error]: javascript.0 (1121)     at step (script.js.NSPanels.Panel2:33:23)
                    25.11.2023, 19:11:24.544	[error]: javascript.0 (1121)     at Object.next (script.js.NSPanels.Panel2:14:53)
                    25.11.2023, 19:11:24.544	[error]: javascript.0 (1121)     at script.js.NSPanels.Panel2:8:71
                    25.11.2023, 19:11:24.545	[error]: javascript.0 (1121)     at __awaiter (script.js.NSPanels.Panel2:4:12)
                    25.11.2023, 19:11:24.546	[error]: javascript.0 (1121)     at Init_dayjs (script.js.NSPanels.Panel2:956:12)
                    25.11.2023, 19:11:24.546	[error]: javascript.0 (1121)     at script.js.NSPanels.Panel2:977:1
                    25.11.2023, 19:11:24.549	[error]: javascript.0 (1121) script.js.NSPanels.Panel2: Error: Cannot find module 'dayjs/locale/de'
                    25.11.2023, 19:11:24.551	[error]: javascript.0 (1121)     at script.js.NSPanels.Panel2:966:21
                    25.11.2023, 19:11:24.552	[error]: javascript.0 (1121)     at step (script.js.NSPanels.Panel2:33:23)
                    25.11.2023, 19:11:24.552	[error]: javascript.0 (1121)     at Object.next (script.js.NSPanels.Panel2:14:53)
                    25.11.2023, 19:11:24.553	[error]: javascript.0 (1121)     at script.js.NSPanels.Panel2:8:71
                    25.11.2023, 19:11:24.553	[error]: javascript.0 (1121)     at __awaiter (script.js.NSPanels.Panel2:4:12)
                    25.11.2023, 19:11:24.554	[error]: javascript.0 (1121)     at Init_dayjs (script.js.NSPanels.Panel2:956:12)
                    25.11.2023, 19:11:24.554	[error]: javascript.0 (1121)     at script.js.NSPanels.Panel2:977:1
                    25.11.2023, 19:11:24.557	[error]: javascript.0 (1121) script.js.NSPanels.Panel2: Error: Cannot find module 'dayjs/locale/nl'
                    25.11.2023, 19:11:24.558	[error]: javascript.0 (1121)     at script.js.NSPanels.Panel2:966:21
                    25.11.2023, 19:11:24.558	[error]: javascript.0 (1121)     at step (script.js.NSPanels.Panel2:33:23)
                    25.11.2023, 19:11:24.558	[error]: javascript.0 (1121)     at Object.next (script.js.NSPanels.Panel2:14:53)
                    25.11.2023, 19:11:24.559	[error]: javascript.0 (1121)     at script.js.NSPanels.Panel2:8:71
                    25.11.2023, 19:11:24.559	[error]: javascript.0 (1121)     at __awaiter (script.js.NSPanels.Panel2:4:12)
                    25.11.2023, 19:11:24.560	[error]: javascript.0 (1121)     at Init_dayjs (script.js.NSPanels.Panel2:956:12)
                    25.11.2023, 19:11:24.560	[error]: javascript.0 (1121)     at script.js.NSPanels.Panel2:977:1
                    25.11.2023, 19:11:24.562	[error]: javascript.0 (1121) script.js.NSPanels.Panel2: Error: Cannot find module 'dayjs/locale/da'
                    25.11.2023, 19:11:24.563	[error]: javascript.0 (1121)     at script.js.NSPanels.Panel2:966:21
                    25.11.2023, 19:11:24.563	[error]: javascript.0 (1121)     at step (script.js.NSPanels.Panel2:33:23)
                    25.11.2023, 19:11:24.564	[error]: javascript.0 (1121)     at Object.next (script.js.NSPanels.Panel2:14:53)
                    25.11.2023, 19:11:24.564	[error]: javascript.0 (1121)     at script.js.NSPanels.Panel2:8:71
                    25.11.2023, 19:11:24.564	[error]: javascript.0 (1121)     at __awaiter (script.js.NSPanels.Panel2:4:12)
                    25.11.2023, 19:11:24.565	[error]: javascript.0 (1121)     at Init_dayjs (script.js.NSPanels.Panel2:956:12)
                    25.11.2023, 19:11:24.565	[error]: javascript.0 (1121)     at script.js.NSPanels.Panel2:977:1
                    25.11.2023, 19:11:24.567	[error]: javascript.0 (1121) script.js.NSPanels.Panel2: Error: Cannot find module 'dayjs/locale/es'
                    25.11.2023, 19:11:24.570	[error]: javascript.0 (1121)     at script.js.NSPanels.Panel2:966:21
                    25.11.2023, 19:11:24.571	[error]: javascript.0 (1121)     at step (script.js.NSPanels.Panel2:33:23)
                    25.11.2023, 19:11:24.572	[error]: javascript.0 (1121)     at Object.next (script.js.NSPanels.Panel2:14:53)
                    25.11.2023, 19:11:24.573	[error]: javascript.0 (1121)     at script.js.NSPanels.Panel2:8:71
                    25.11.2023, 19:11:24.574	[error]: javascript.0 (1121)     at __awaiter (script.js.NSPanels.Panel2:4:12)
                    25.11.2023, 19:11:24.575	[error]: javascript.0 (1121)     at Init_dayjs (script.js.NSPanels.Panel2:956:12)
                    25.11.2023, 19:11:24.576	[error]: javascript.0 (1121)     at script.js.NSPanels.Panel2:977:1
                    25.11.2023, 19:11:24.580	[error]: javascript.0 (1121) script.js.NSPanels.Panel2: Error: Cannot find module 'dayjs/locale/fr'
                    25.11.2023, 19:11:24.581	[error]: javascript.0 (1121)     at script.js.NSPanels.Panel2:966:21
                    25.11.2023, 19:11:24.581	[error]: javascript.0 (1121)     at step (script.js.NSPanels.Panel2:33:23)
                    25.11.2023, 19:11:24.582	[error]: javascript.0 (1121)     at Object.next (script.js.NSPanels.Panel2:14:53)
                    25.11.2023, 19:11:24.582	[error]: javascript.0 (1121)     at script.js.NSPanels.Panel2:8:71
                    25.11.2023, 19:11:24.583	[error]: javascript.0 (1121)     at __awaiter (script.js.NSPanels.Panel2:4:12)
                    25.11.2023, 19:11:24.583	[error]: javascript.0 (1121)     at Init_dayjs (script.js.NSPanels.Panel2:956:12)
                    25.11.2023, 19:11:24.583	[error]: javascript.0 (1121)     at script.js.NSPanels.Panel2:977:1
                    25.11.2023, 19:11:24.585	[error]: javascript.0 (1121) script.js.NSPanels.Panel2: Error: Cannot find module 'dayjs/locale/it'
                    25.11.2023, 19:11:24.586	[error]: javascript.0 (1121)     at script.js.NSPanels.Panel2:966:21
                    25.11.2023, 19:11:24.587	[error]: javascript.0 (1121)     at step (script.js.NSPanels.Panel2:33:23)
                    25.11.2023, 19:11:24.587	[error]: javascript.0 (1121)     at Object.next (script.js.NSPanels.Panel2:14:53)
                    25.11.2023, 19:11:24.587	[error]: javascript.0 (1121)     at script.js.NSPanels.Panel2:8:71
                    25.11.2023, 19:11:24.588	[error]: javascript.0 (1121)     at __awaiter (script.js.NSPanels.Panel2:4:12)
                    25.11.2023, 19:11:24.588	[error]: javascript.0 (1121)     at Init_dayjs (script.js.NSPanels.Panel2:956:12)
                    25.11.2023, 19:11:24.588	[error]: javascript.0 (1121)     at script.js.NSPanels.Panel2:977:1
                    25.11.2023, 19:11:24.590	[error]: javascript.0 (1121) script.js.NSPanels.Panel2: Error: Cannot find module 'dayjs/locale/ru'
                    25.11.2023, 19:11:24.592	[error]: javascript.0 (1121)     at script.js.NSPanels.Panel2:966:21
                    25.11.2023, 19:11:24.592	[error]: javascript.0 (1121)     at step (script.js.NSPanels.Panel2:33:23)
                    25.11.2023, 19:11:24.592	[error]: javascript.0 (1121)     at Object.next (script.js.NSPanels.Panel2:14:53)
                    25.11.2023, 19:11:24.593	[error]: javascript.0 (1121)     at script.js.NSPanels.Panel2:8:71
                    25.11.2023, 19:11:24.593	[error]: javascript.0 (1121)     at __awaiter (script.js.NSPanels.Panel2:4:12)
                    25.11.2023, 19:11:24.593	[error]: javascript.0 (1121)     at Init_dayjs (script.js.NSPanels.Panel2:956:12)
                    25.11.2023, 19:11:24.594	[error]: javascript.0 (1121)     at script.js.NSPanels.Panel2:977:1
                    25.11.2023, 19:11:24.596	[error]: javascript.0 (1121) script.js.NSPanels.Panel2: Error: Cannot find module 'dayjs/locale/nb'
                    25.11.2023, 19:11:24.597	[error]: javascript.0 (1121)     at script.js.NSPanels.Panel2:966:21
                    25.11.2023, 19:11:24.597	[error]: javascript.0 (1121)     at step (script.js.NSPanels.Panel2:33:23)
                    25.11.2023, 19:11:24.597	[error]: javascript.0 (1121)     at Object.next (script.js.NSPanels.Panel2:14:53)
                    25.11.2023, 19:11:24.598	[error]: javascript.0 (1121)     at script.js.NSPanels.Panel2:8:71
                    25.11.2023, 19:11:24.598	[error]: javascript.0 (1121)     at __awaiter (script.js.NSPanels.Panel2:4:12)
                    25.11.2023, 19:11:24.599	[error]: javascript.0 (1121)     at Init_dayjs (script.js.NSPanels.Panel2:956:12)
                    25.11.2023, 19:11:24.599	[error]: javascript.0 (1121)     at script.js.NSPanels.Panel2:977:1
                    25.11.2023, 19:11:24.601	[error]: javascript.0 (1121) script.js.NSPanels.Panel2: Error: Cannot find module 'dayjs/locale/nn'
                    25.11.2023, 19:11:24.602	[error]: javascript.0 (1121)     at script.js.NSPanels.Panel2:966:21
                    25.11.2023, 19:11:24.603	[error]: javascript.0 (1121)     at step (script.js.NSPanels.Panel2:33:23)
                    25.11.2023, 19:11:24.603	[error]: javascript.0 (1121)     at Object.next (script.js.NSPanels.Panel2:14:53)
                    25.11.2023, 19:11:24.603	[error]: javascript.0 (1121)     at script.js.NSPanels.Panel2:8:71
                    25.11.2023, 19:11:24.604	[error]: javascript.0 (1121)     at __awaiter (script.js.NSPanels.Panel2:4:12)
                    25.11.2023, 19:11:24.604	[error]: javascript.0 (1121)     at Init_dayjs (script.js.NSPanels.Panel2:956:12)
                    25.11.2023, 19:11:24.604	[error]: javascript.0 (1121)     at script.js.NSPanels.Panel2:977:1
                    25.11.2023, 19:11:24.611	[error]: javascript.0 (1121) script.js.NSPanels.Panel2: Error: Cannot find module 'dayjs/locale/pl'
                    25.11.2023, 19:11:24.612	[error]: javascript.0 (1121)     at script.js.NSPanels.Panel2:966:21
                    25.11.2023, 19:11:24.613	[error]: javascript.0 (1121)     at step (script.js.NSPanels.Panel2:33:23)
                    25.11.2023, 19:11:24.613	[error]: javascript.0 (1121)     at Object.next (script.js.NSPanels.Panel2:14:53)
                    25.11.2023, 19:11:24.613	[error]: javascript.0 (1121)     at script.js.NSPanels.Panel2:8:71
                    25.11.2023, 19:11:24.614	[error]: javascript.0 (1121)     at __awaiter (script.js.NSPanels.Panel2:4:12)
                    25.11.2023, 19:11:24.614	[error]: javascript.0 (1121)     at Init_dayjs (script.js.NSPanels.Panel2:956:12)
                    25.11.2023, 19:11:24.614	[error]: javascript.0 (1121)     at script.js.NSPanels.Panel2:977:1
                    25.11.2023, 19:11:24.616	[error]: javascript.0 (1121) script.js.NSPanels.Panel2: Error: Cannot find module 'dayjs/locale/pt'
                    25.11.2023, 19:11:24.618	[error]: javascript.0 (1121)     at script.js.NSPanels.Panel2:966:21
                    25.11.2023, 19:11:24.618	[error]: javascript.0 (1121)     at step (script.js.NSPanels.Panel2:33:23)
                    25.11.2023, 19:11:24.618	[error]: javascript.0 (1121)     at Object.next (script.js.NSPanels.Panel2:14:53)
                    25.11.2023, 19:11:24.619	[error]: javascript.0 (1121)     at script.js.NSPanels.Panel2:8:71
                    25.11.2023, 19:11:24.619	[error]: javascript.0 (1121)     at __awaiter (script.js.NSPanels.Panel2:4:12)
                    25.11.2023, 19:11:24.620	[error]: javascript.0 (1121)     at Init_dayjs (script.js.NSPanels.Panel2:956:12)
                    25.11.2023, 19:11:24.620	[error]: javascript.0 (1121)     at script.js.NSPanels.Panel2:977:1
                    25.11.2023, 19:11:24.622	[error]: javascript.0 (1121) script.js.NSPanels.Panel2: Error: Cannot find module 'dayjs/locale/af'
                    25.11.2023, 19:11:24.623	[error]: javascript.0 (1121)     at script.js.NSPanels.Panel2:966:21
                    25.11.2023, 19:11:24.624	[error]: javascript.0 (1121)     at step (script.js.NSPanels.Panel2:33:23)
                    25.11.2023, 19:11:24.624	[error]: javascript.0 (1121)     at Object.next (script.js.NSPanels.Panel2:14:53)
                    25.11.2023, 19:11:24.624	[error]: javascript.0 (1121)     at script.js.NSPanels.Panel2:8:71
                    25.11.2023, 19:11:24.625	[error]: javascript.0 (1121)     at __awaiter (script.js.NSPanels.Panel2:4:12)
                    25.11.2023, 19:11:24.625	[error]: javascript.0 (1121)     at Init_dayjs (script.js.NSPanels.Panel2:956:12)
                    25.11.2023, 19:11:24.625	[error]: javascript.0 (1121)     at script.js.NSPanels.Panel2:977:1
                    25.11.2023, 19:11:24.627	[error]: javascript.0 (1121) script.js.NSPanels.Panel2: Error: Cannot find module 'dayjs/locale/ar'
                    25.11.2023, 19:11:24.628	[error]: javascript.0 (1121)     at script.js.NSPanels.Panel2:966:21
                    25.11.2023, 19:11:24.629	[error]: javascript.0 (1121)     at step (script.js.NSPanels.Panel2:33:23)
                    25.11.2023, 19:11:24.629	[error]: javascript.0 (1121)     at Object.next (script.js.NSPanels.Panel2:14:53)
                    25.11.2023, 19:11:24.629	[error]: javascript.0 (1121)     at script.js.NSPanels.Panel2:8:71
                    25.11.2023, 19:11:24.630	[error]: javascript.0 (1121)     at __awaiter (script.js.NSPanels.Panel2:4:12)
                    25.11.2023, 19:11:24.630	[error]: javascript.0 (1121)     at Init_dayjs (script.js.NSPanels.Panel2:956:12)
                    25.11.2023, 19:11:24.630	[error]: javascript.0 (1121)     at script.js.NSPanels.Panel2:977:1
                    25.11.2023, 19:11:24.632	[error]: javascript.0 (1121) script.js.NSPanels.Panel2: Error: Cannot find module 'dayjs/locale/bg'
                    25.11.2023, 19:11:24.634	[error]: javascript.0 (1121)     at script.js.NSPanels.Panel2:966:21
                    25.11.2023, 19:11:24.634	[error]: javascript.0 (1121)     at step (script.js.NSPanels.Panel2:33:23)
                    25.11.2023, 19:11:24.634	[error]: javascript.0 (1121)     at Object.next (script.js.NSPanels.Panel2:14:53)
                    25.11.2023, 19:11:24.634	[error]: javascript.0 (1121)     at script.js.NSPanels.Panel2:8:71
                    25.11.2023, 19:11:24.635	[error]: javascript.0 (1121)     at __awaiter (script.js.NSPanels.Panel2:4:12)
                    25.11.2023, 19:11:24.635	[error]: javascript.0 (1121)     at Init_dayjs (script.js.NSPanels.Panel2:956:12)
                    25.11.2023, 19:11:24.636	[error]: javascript.0 (1121)     at script.js.NSPanels.Panel2:977:1
                    25.11.2023, 19:11:24.638	[error]: javascript.0 (1121) script.js.NSPanels.Panel2: Error: Cannot find module 'dayjs/locale/ca'
                    25.11.2023, 19:11:24.649	[error]: javascript.0 (1121)     at script.js.NSPanels.Panel2:966:21
                    25.11.2023, 19:11:24.649	[error]: javascript.0 (1121)     at step (script.js.NSPanels.Panel2:33:23)
                    25.11.2023, 19:11:24.650	[error]: javascript.0 (1121)     at Object.next (script.js.NSPanels.Panel2:14:53)
                    25.11.2023, 19:11:24.650	[error]: javascript.0 (1121)     at script.js.NSPanels.Panel2:8:71
                    25.11.2023, 19:11:24.651	[error]: javascript.0 (1121)     at __awaiter (script.js.NSPanels.Panel2:4:12)
                    25.11.2023, 19:11:24.651	[error]: javascript.0 (1121)     at Init_dayjs (script.js.NSPanels.Panel2:956:12)
                    25.11.2023, 19:11:24.652	[error]: javascript.0 (1121)     at script.js.NSPanels.Panel2:977:1
                    25.11.2023, 19:11:24.654	[error]: javascript.0 (1121) script.js.NSPanels.Panel2: Error: Cannot find module 'dayjs/locale/cs'
                    25.11.2023, 19:11:24.669	[error]: javascript.0 (1121)     at script.js.NSPanels.Panel2:966:21
                    25.11.2023, 19:11:24.669	[error]: javascript.0 (1121)     at step (script.js.NSPanels.Panel2:33:23)
                    25.11.2023, 19:11:24.670	[error]: javascript.0 (1121)     at Object.next (script.js.NSPanels.Panel2:14:53)
                    25.11.2023, 19:11:24.670	[error]: javascript.0 (1121)     at script.js.NSPanels.Panel2:8:71
                    25.11.2023, 19:11:24.670	[error]: javascript.0 (1121)     at __awaiter (script.js.NSPanels.Panel2:4:12)
                    25.11.2023, 19:11:24.671	[error]: javascript.0 (1121)     at Init_dayjs (script.js.NSPanels.Panel2:956:12)
                    25.11.2023, 19:11:24.671	[error]: javascript.0 (1121)     at script.js.NSPanels.Panel2:977:1
                    25.11.2023, 19:11:24.673	[error]: javascript.0 (1121) script.js.NSPanels.Panel2: Error: Cannot find module 'dayjs/locale/el'
                    25.11.2023, 19:11:24.674	[error]: javascript.0 (1121)     at script.js.NSPanels.Panel2:966:21
                    25.11.2023, 19:11:24.674	[error]: javascript.0 (1121)     at step (script.js.NSPanels.Panel2:33:23)
                    25.11.2023, 19:11:24.675	[error]: javascript.0 (1121)     at Object.next (script.js.NSPanels.Panel2:14:53)
                    25.11.2023, 19:11:24.675	[error]: javascript.0 (1121)     at script.js.NSPanels.Panel2:8:71
                    25.11.2023, 19:11:24.675	[error]: javascript.0 (1121)     at __awaiter (script.js.NSPanels.Panel2:4:12)
                    25.11.2023, 19:11:24.676	[error]: javascript.0 (1121)     at Init_dayjs (script.js.NSPanels.Panel2:956:12)
                    25.11.2023, 19:11:24.676	[error]: javascript.0 (1121)     at script.js.NSPanels.Panel2:977:1
                    25.11.2023, 19:11:24.678	[error]: javascript.0 (1121) script.js.NSPanels.Panel2: Error: Cannot find module 'dayjs/locale/et'
                    25.11.2023, 19:11:24.679	[error]: javascript.0 (1121)     at script.js.NSPanels.Panel2:966:21
                    25.11.2023, 19:11:24.679	[error]: javascript.0 (1121)     at step (script.js.NSPanels.Panel2:33:23)
                    25.11.2023, 19:11:24.679	[error]: javascript.0 (1121)     at Object.next (script.js.NSPanels.Panel2:14:53)
                    25.11.2023, 19:11:24.680	[error]: javascript.0 (1121)     at script.js.NSPanels.Panel2:8:71
                    25.11.2023, 19:11:24.680	[error]: javascript.0 (1121)     at __awaiter (script.js.NSPanels.Panel2:4:12)
                    25.11.2023, 19:11:24.680	[error]: javascript.0 (1121)     at Init_dayjs (script.js.NSPanels.Panel2:956:12)
                    25.11.2023, 19:11:24.681	[error]: javascript.0 (1121)     at script.js.NSPanels.Panel2:977:1
                    25.11.2023, 19:11:24.683	[error]: javascript.0 (1121) script.js.NSPanels.Panel2: Error: Cannot find module 'dayjs/locale/fa'
                    25.11.2023, 19:11:24.684	[error]: javascript.0 (1121)     at script.js.NSPanels.Panel2:966:21
                    25.11.2023, 19:11:24.684	[error]: javascript.0 (1121)     at step (script.js.NSPanels.Panel2:33:23)
                    25.11.2023, 19:11:24.684	[error]: javascript.0 (1121)     at Object.next (script.js.NSPanels.Panel2:14:53)
                    25.11.2023, 19:11:24.684	[error]: javascript.0 (1121)     at script.js.NSPanels.Panel2:8:71
                    25.11.2023, 19:11:24.685	[error]: javascript.0 (1121)     at __awaiter (script.js.NSPanels.Panel2:4:12)
                    25.11.2023, 19:11:24.685	[error]: javascript.0 (1121)     at Init_dayjs (script.js.NSPanels.Panel2:956:12)
                    25.11.2023, 19:11:24.685	[error]: javascript.0 (1121)     at script.js.NSPanels.Panel2:977:1
                    25.11.2023, 19:11:24.687	[error]: javascript.0 (1121) script.js.NSPanels.Panel2: Error: Cannot find module 'dayjs/locale/fi'
                    25.11.2023, 19:11:24.688	[error]: javascript.0 (1121)     at script.js.NSPanels.Panel2:966:21
                    25.11.2023, 19:11:24.689	[error]: javascript.0 (1121)     at step (script.js.NSPanels.Panel2:33:23)
                    25.11.2023, 19:11:24.689	[error]: javascript.0 (1121)     at Object.next (script.js.NSPanels.Panel2:14:53)
                    25.11.2023, 19:11:24.689	[error]: javascript.0 (1121)     at script.js.NSPanels.Panel2:8:71
                    25.11.2023, 19:11:24.690	[error]: javascript.0 (1121)     at __awaiter (script.js.NSPanels.Panel2:4:12)
                    25.11.2023, 19:11:24.690	[error]: javascript.0 (1121)     at Init_dayjs (script.js.NSPanels.Panel2:956:12)
                    25.11.2023, 19:11:24.690	[error]: javascript.0 (1121)     at script.js.NSPanels.Panel2:977:1
                    25.11.2023, 19:11:24.692	[error]: javascript.0 (1121) script.js.NSPanels.Panel2: Error: Cannot find module 'dayjs/locale/he'
                    25.11.2023, 19:11:24.694	[error]: javascript.0 (1121)     at script.js.NSPanels.Panel2:966:21
                    25.11.2023, 19:11:24.694	[error]: javascript.0 (1121)     at step (script.js.NSPanels.Panel2:33:23)
                    25.11.2023, 19:11:24.694	[error]: javascript.0 (1121)     at Object.next (script.js.NSPanels.Panel2:14:53)
                    25.11.2023, 19:11:24.695	[error]: javascript.0 (1121)     at script.js.NSPanels.Panel2:8:71
                    25.11.2023, 19:11:24.695	[error]: javascript.0 (1121)     at __awaiter (script.js.NSPanels.Panel2:4:12)
                    25.11.2023, 19:11:24.696	[error]: javascript.0 (1121)     at Init_dayjs (script.js.NSPanels.Panel2:956:12)
                    25.11.2023, 19:11:24.696	[error]: javascript.0 (1121)     at script.js.NSPanels.Panel2:977:1
                    25.11.2023, 19:11:24.698	[error]: javascript.0 (1121) script.js.NSPanels.Panel2: Error: Cannot find module 'dayjs/locale/hr'
                    25.11.2023, 19:11:24.700	[error]: javascript.0 (1121)     at script.js.NSPanels.Panel2:966:21
                    25.11.2023, 19:11:24.700	[error]: javascript.0 (1121)     at step (script.js.NSPanels.Panel2:33:23)
                    25.11.2023, 19:11:24.700	[error]: javascript.0 (1121)     at Object.next (script.js.NSPanels.Panel2:14:53)
                    25.11.2023, 19:11:24.700	[error]: javascript.0 (1121)     at script.js.NSPanels.Panel2:8:71
                    25.11.2023, 19:11:24.701	[error]: javascript.0 (1121)     at __awaiter (script.js.NSPanels.Panel2:4:12)
                    25.11.2023, 19:11:24.701	[error]: javascript.0 (1121)     at Init_dayjs (script.js.NSPanels.Panel2:956:12)
                    25.11.2023, 19:11:24.702	[error]: javascript.0 (1121)     at script.js.NSPanels.Panel2:977:1
                    25.11.2023, 19:11:24.704	[error]: javascript.0 (1121) script.js.NSPanels.Panel2: Error: Cannot find module 'dayjs/locale/hu'
                    25.11.2023, 19:11:24.705	[error]: javascript.0 (1121)     at script.js.NSPanels.Panel2:966:21
                    25.11.2023, 19:11:24.705	[error]: javascript.0 (1121)     at step (script.js.NSPanels.Panel2:33:23)
                    25.11.2023, 19:11:24.706	[error]: javascript.0 (1121)     at Object.next (script.js.NSPanels.Panel2:14:53)
                    25.11.2023, 19:11:24.706	[error]: javascript.0 (1121)     at script.js.NSPanels.Panel2:8:71
                    25.11.2023, 19:11:24.706	[error]: javascript.0 (1121)     at __awaiter (script.js.NSPanels.Panel2:4:12)
                    25.11.2023, 19:11:24.707	[error]: javascript.0 (1121)     at Init_dayjs (script.js.NSPanels.Panel2:956:12)
                    25.11.2023, 19:11:24.707	[error]: javascript.0 (1121)     at script.js.NSPanels.Panel2:977:1
                    25.11.2023, 19:11:24.709	[error]: javascript.0 (1121) script.js.NSPanels.Panel2: Error: Cannot find module 'dayjs/locale/hy-am'
                    25.11.2023, 19:11:24.711	[error]: javascript.0 (1121)     at script.js.NSPanels.Panel2:966:21
                    25.11.2023, 19:11:24.711	[error]: javascript.0 (1121)     at step (script.js.NSPanels.Panel2:33:23)
                    25.11.2023, 19:11:24.711	[error]: javascript.0 (1121)     at Object.next (script.js.NSPanels.Panel2:14:53)
                    25.11.2023, 19:11:24.711	[error]: javascript.0 (1121)     at script.js.NSPanels.Panel2:8:71
                    25.11.2023, 19:11:24.712	[error]: javascript.0 (1121)     at __awaiter (script.js.NSPanels.Panel2:4:12)
                    25.11.2023, 19:11:24.712	[error]: javascript.0 (1121)     at Init_dayjs (script.js.NSPanels.Panel2:956:12)
                    25.11.2023, 19:11:24.712	[error]: javascript.0 (1121)     at script.js.NSPanels.Panel2:977:1
                    25.11.2023, 19:11:24.714	[error]: javascript.0 (1121) script.js.NSPanels.Panel2: Error: Cannot find module 'dayjs/locale/id'
                    25.11.2023, 19:11:24.715	[error]: javascript.0 (1121)     at script.js.NSPanels.Panel2:966:21
                    25.11.2023, 19:11:24.715	[error]: javascript.0 (1121)     at step (script.js.NSPanels.Panel2:33:23)
                    25.11.2023, 19:11:24.716	[error]: javascript.0 (1121)     at Object.next (script.js.NSPanels.Panel2:14:53)
                    25.11.2023, 19:11:24.716	[error]: javascript.0 (1121)     at script.js.NSPanels.Panel2:8:71
                    25.11.2023, 19:11:24.717	[error]: javascript.0 (1121)     at __awaiter (script.js.NSPanels.Panel2:4:12)
                    25.11.2023, 19:11:24.717	[error]: javascript.0 (1121)     at Init_dayjs (script.js.NSPanels.Panel2:956:12)
                    25.11.2023, 19:11:24.717	[error]: javascript.0 (1121)     at script.js.NSPanels.Panel2:977:1
                    25.11.2023, 19:11:24.721	[error]: javascript.0 (1121) script.js.NSPanels.Panel2: Error: Cannot find module 'dayjs/locale/is'
                    25.11.2023, 19:11:24.722	[error]: javascript.0 (1121)     at script.js.NSPanels.Panel2:966:21
                    25.11.2023, 19:11:24.723	[error]: javascript.0 (1121)     at step (script.js.NSPanels.Panel2:33:23)
                    25.11.2023, 19:11:24.723	[error]: javascript.0 (1121)     at Object.next (script.js.NSPanels.Panel2:14:53)
                    25.11.2023, 19:11:24.723	[error]: javascript.0 (1121)     at script.js.NSPanels.Panel2:8:71
                    25.11.2023, 19:11:24.723	[error]: javascript.0 (1121)     at __awaiter (script.js.NSPanels.Panel2:4:12)
                    25.11.2023, 19:11:24.724	[error]: javascript.0 (1121)     at Init_dayjs (script.js.NSPanels.Panel2:956:12)
                    25.11.2023, 19:11:24.724	[error]: javascript.0 (1121)     at script.js.NSPanels.Panel2:977:1
                    25.11.2023, 19:11:24.726	[error]: javascript.0 (1121) script.js.NSPanels.Panel2: Error: Cannot find module 'dayjs/locale/lb'
                    25.11.2023, 19:11:24.727	[error]: javascript.0 (1121)     at script.js.NSPanels.Panel2:966:21
                    25.11.2023, 19:11:24.727	[error]: javascript.0 (1121)     at step (script.js.NSPanels.Panel2:33:23)
                    25.11.2023, 19:11:24.728	[error]: javascript.0 (1121)     at Object.next (script.js.NSPanels.Panel2:14:53)
                    25.11.2023, 19:11:24.728	[error]: javascript.0 (1121)     at script.js.NSPanels.Panel2:8:71
                    25.11.2023, 19:11:24.729	[error]: javascript.0 (1121)     at __awaiter (script.js.NSPanels.Panel2:4:12)
                    25.11.2023, 19:11:24.730	[error]: javascript.0 (1121)     at Init_dayjs (script.js.NSPanels.Panel2:956:12)
                    25.11.2023, 19:11:24.731	[error]: javascript.0 (1121)     at script.js.NSPanels.Panel2:977:1
                    25.11.2023, 19:11:24.735	[error]: javascript.0 (1121) script.js.NSPanels.Panel2: Error: Cannot find module 'dayjs/locale/lt'
                    25.11.2023, 19:11:24.736	[error]: javascript.0 (1121)     at script.js.NSPanels.Panel2:966:21
                    25.11.2023, 19:11:24.737	[error]: javascript.0 (1121)     at step (script.js.NSPanels.Panel2:33:23)
                    25.11.2023, 19:11:24.737	[error]: javascript.0 (1121)     at Object.next (script.js.NSPanels.Panel2:14:53)
                    25.11.2023, 19:11:24.737	[error]: javascript.0 (1121)     at script.js.NSPanels.Panel2:8:71
                    25.11.2023, 19:11:24.738	[error]: javascript.0 (1121)     at __awaiter (script.js.NSPanels.Panel2:4:12)
                    25.11.2023, 19:11:24.738	[error]: javascript.0 (1121)     at Init_dayjs (script.js.NSPanels.Panel2:956:12)
                    25.11.2023, 19:11:24.739	[error]: javascript.0 (1121)     at script.js.NSPanels.Panel2:977:1
                    25.11.2023, 19:11:24.741	[error]: javascript.0 (1121) script.js.NSPanels.Panel2: Error: Cannot find module 'dayjs/locale/ro'
                    25.11.2023, 19:11:24.743	[error]: javascript.0 (1121)     at script.js.NSPanels.Panel2:966:21
                    25.11.2023, 19:11:24.743	[error]: javascript.0 (1121)     at step (script.js.NSPanels.Panel2:33:23)
                    25.11.2023, 19:11:24.743	[error]: javascript.0 (1121)     at Object.next (script.js.NSPanels.Panel2:14:53)
                    25.11.2023, 19:11:24.744	[error]: javascript.0 (1121)     at script.js.NSPanels.Panel2:8:71
                    25.11.2023, 19:11:24.744	[error]: javascript.0 (1121)     at __awaiter (script.js.NSPanels.Panel2:4:12)
                    25.11.2023, 19:11:24.745	[error]: javascript.0 (1121)     at Init_dayjs (script.js.NSPanels.Panel2:956:12)
                    25.11.2023, 19:11:24.745	[error]: javascript.0 (1121)     at script.js.NSPanels.Panel2:977:1
                    25.11.2023, 19:11:24.747	[error]: javascript.0 (1121) script.js.NSPanels.Panel2: Error: Cannot find module 'dayjs/locale/sk'
                    25.11.2023, 19:11:24.751	[error]: javascript.0 (1121)     at script.js.NSPanels.Panel2:966:21
                    25.11.2023, 19:11:24.751	[error]: javascript.0 (1121)     at step (script.js.NSPanels.Panel2:33:23)
                    25.11.2023, 19:11:24.752	[error]: javascript.0 (1121)     at Object.next (script.js.NSPanels.Panel2:14:53)
                    25.11.2023, 19:11:24.752	[error]: javascript.0 (1121)     at script.js.NSPanels.Panel2:8:71
                    25.11.2023, 19:11:24.752	[error]: javascript.0 (1121)     at __awaiter (script.js.NSPanels.Panel2:4:12)
                    25.11.2023, 19:11:24.752	[error]: javascript.0 (1121)     at Init_dayjs (script.js.NSPanels.Panel2:956:12)
                    25.11.2023, 19:11:24.753	[error]: javascript.0 (1121)     at script.js.NSPanels.Panel2:977:1
                    25.11.2023, 19:11:24.754	[error]: javascript.0 (1121) script.js.NSPanels.Panel2: Error: Cannot find module 'dayjs/locale/sl'
                    25.11.2023, 19:11:24.756	[error]: javascript.0 (1121)     at script.js.NSPanels.Panel2:966:21
                    25.11.2023, 19:11:24.756	[error]: javascript.0 (1121)     at step (script.js.NSPanels.Panel2:33:23)
                    25.11.2023, 19:11:24.756	[error]: javascript.0 (1121)     at Object.next (script.js.NSPanels.Panel2:14:53)
                    25.11.2023, 19:11:24.756	[error]: javascript.0 (1121)     at script.js.NSPanels.Panel2:8:71
                    25.11.2023, 19:11:24.757	[error]: javascript.0 (1121)     at __awaiter (script.js.NSPanels.Panel2:4:12)
                    25.11.2023, 19:11:24.757	[error]: javascript.0 (1121)     at Init_dayjs (script.js.NSPanels.Panel2:956:12)
                    25.11.2023, 19:11:24.757	[error]: javascript.0 (1121)     at script.js.NSPanels.Panel2:977:1
                    25.11.2023, 19:11:24.760	[error]: javascript.0 (1121) script.js.NSPanels.Panel2: Error: Cannot find module 'dayjs/locale/sv'
                    25.11.2023, 19:11:24.761	[error]: javascript.0 (1121)     at script.js.NSPanels.Panel2:966:21
                    25.11.2023, 19:11:24.761	[error]: javascript.0 (1121)     at step (script.js.NSPanels.Panel2:33:23)
                    25.11.2023, 19:11:24.761	[error]: javascript.0 (1121)     at Object.next (script.js.NSPanels.Panel2:14:53)
                    25.11.2023, 19:11:24.761	[error]: javascript.0 (1121)     at script.js.NSPanels.Panel2:8:71
                    25.11.2023, 19:11:24.762	[error]: javascript.0 (1121)     at __awaiter (script.js.NSPanels.Panel2:4:12)
                    25.11.2023, 19:11:24.762	[error]: javascript.0 (1121)     at Init_dayjs (script.js.NSPanels.Panel2:956:12)
                    25.11.2023, 19:11:24.762	[error]: javascript.0 (1121)     at script.js.NSPanels.Panel2:977:1
                    25.11.2023, 19:11:24.764	[error]: javascript.0 (1121) script.js.NSPanels.Panel2: Error: Cannot find module 'dayjs/locale/th'
                    25.11.2023, 19:11:24.766	[error]: javascript.0 (1121)     at script.js.NSPanels.Panel2:966:21
                    25.11.2023, 19:11:24.766	[error]: javascript.0 (1121)     at step (script.js.NSPanels.Panel2:33:23)
                    25.11.2023, 19:11:24.766	[error]: javascript.0 (1121)     at Object.next (script.js.NSPanels.Panel2:14:53)
                    25.11.2023, 19:11:24.767	[error]: javascript.0 (1121)     at script.js.NSPanels.Panel2:8:71
                    25.11.2023, 19:11:24.767	[error]: javascript.0 (1121)     at __awaiter (script.js.NSPanels.Panel2:4:12)
                    25.11.2023, 19:11:24.768	[error]: javascript.0 (1121)     at Init_dayjs (script.js.NSPanels.Panel2:956:12)
                    25.11.2023, 19:11:24.768	[error]: javascript.0 (1121)     at script.js.NSPanels.Panel2:977:1
                    25.11.2023, 19:11:24.770	[error]: javascript.0 (1121) script.js.NSPanels.Panel2: Error: Cannot find module 'dayjs/locale/tr'
                    25.11.2023, 19:11:24.773	[error]: javascript.0 (1121)     at script.js.NSPanels.Panel2:966:21
                    25.11.2023, 19:11:24.779	[error]: javascript.0 (1121)     at step (script.js.NSPanels.Panel2:33:23)
                    25.11.2023, 19:11:24.780	[error]: javascript.0 (1121)     at Object.next (script.js.NSPanels.Panel2:14:53)
                    25.11.2023, 19:11:24.780	[error]: javascript.0 (1121)     at script.js.NSPanels.Panel2:8:71
                    25.11.2023, 19:11:24.781	[error]: javascript.0 (1121)     at __awaiter (script.js.NSPanels.Panel2:4:12)
                    25.11.2023, 19:11:24.782	[error]: javascript.0 (1121)     at Init_dayjs (script.js.NSPanels.Panel2:956:12)
                    25.11.2023, 19:11:24.782	[error]: javascript.0 (1121)     at script.js.NSPanels.Panel2:977:1
                    25.11.2023, 19:11:24.785	[error]: javascript.0 (1121) script.js.NSPanels.Panel2: Error: Cannot find module 'dayjs/locale/uk'
                    25.11.2023, 19:11:24.786	[error]: javascript.0 (1121)     at script.js.NSPanels.Panel2:966:21
                    25.11.2023, 19:11:24.787	[error]: javascript.0 (1121)     at step (script.js.NSPanels.Panel2:33:23)
                    25.11.2023, 19:11:24.787	[error]: javascript.0 (1121)     at Object.next (script.js.NSPanels.Panel2:14:53)
                    25.11.2023, 19:11:24.787	[error]: javascript.0 (1121)     at script.js.NSPanels.Panel2:8:71
                    25.11.2023, 19:11:24.787	[error]: javascript.0 (1121)     at __awaiter (script.js.NSPanels.Panel2:4:12)
                    25.11.2023, 19:11:24.788	[error]: javascript.0 (1121)     at Init_dayjs (script.js.NSPanels.Panel2:956:12)
                    25.11.2023, 19:11:24.788	[error]: javascript.0 (1121)     at script.js.NSPanels.Panel2:977:1
                    25.11.2023, 19:11:24.790	[error]: javascript.0 (1121) script.js.NSPanels.Panel2: Error: Cannot find module 'dayjs/locale/vi'
                    25.11.2023, 19:11:24.791	[error]: javascript.0 (1121)     at script.js.NSPanels.Panel2:966:21
                    25.11.2023, 19:11:24.791	[error]: javascript.0 (1121)     at step (script.js.NSPanels.Panel2:33:23)
                    25.11.2023, 19:11:24.791	[error]: javascript.0 (1121)     at Object.next (script.js.NSPanels.Panel2:14:53)
                    25.11.2023, 19:11:24.791	[error]: javascript.0 (1121)     at script.js.NSPanels.Panel2:8:71
                    25.11.2023, 19:11:24.792	[error]: javascript.0 (1121)     at __awaiter (script.js.NSPanels.Panel2:4:12)
                    25.11.2023, 19:11:24.792	[error]: javascript.0 (1121)     at Init_dayjs (script.js.NSPanels.Panel2:956:12)
                    25.11.2023, 19:11:24.792	[error]: javascript.0 (1121)     at script.js.NSPanels.Panel2:977:1
                    25.11.2023, 19:11:24.794	[error]: javascript.0 (1121) script.js.NSPanels.Panel2: Error: Cannot find module 'dayjs/locale/zh-cn'
                    25.11.2023, 19:11:24.796	[error]: javascript.0 (1121)     at script.js.NSPanels.Panel2:966:21
                    25.11.2023, 19:11:24.796	[error]: javascript.0 (1121)     at step (script.js.NSPanels.Panel2:33:23)
                    25.11.2023, 19:11:24.797	[error]: javascript.0 (1121)     at Object.next (script.js.NSPanels.Panel2:14:53)
                    25.11.2023, 19:11:24.797	[error]: javascript.0 (1121)     at script.js.NSPanels.Panel2:8:71
                    25.11.2023, 19:11:24.798	[error]: javascript.0 (1121)     at __awaiter (script.js.NSPanels.Panel2:4:12)
                    25.11.2023, 19:11:24.798	[error]: javascript.0 (1121)     at Init_dayjs (script.js.NSPanels.Panel2:956:12)
                    25.11.2023, 19:11:24.798	[error]: javascript.0 (1121)     at script.js.NSPanels.Panel2:977:1
                    25.11.2023, 19:11:24.801	[error]: javascript.0 (1121) script.js.NSPanels.Panel2: Error: Cannot find module 'dayjs/locale/zh-tw'
                    25.11.2023, 19:11:24.803	[error]: javascript.0 (1121)     at script.js.NSPanels.Panel2:966:21
                    25.11.2023, 19:11:24.803	[error]: javascript.0 (1121)     at step (script.js.NSPanels.Panel2:33:23)
                    25.11.2023, 19:11:24.804	[error]: javascript.0 (1121)     at Object.next (script.js.NSPanels.Panel2:14:53)
                    25.11.2023, 19:11:24.804	[error]: javascript.0 (1121)     at script.js.NSPanels.Panel2:8:71
                    25.11.2023, 19:11:24.804	[error]: javascript.0 (1121)     at __awaiter (script.js.NSPanels.Panel2:4:12)
                    25.11.2023, 19:11:24.805	[error]: javascript.0 (1121)     at Init_dayjs (script.js.NSPanels.Panel2:956:12)
                    25.11.2023, 19:11:24.805	[error]: javascript.0 (1121)     at script.js.NSPanels.Panel2:977:1
                    25.11.2023, 19:11:24.806	[warn ]: javascript.0 (1121) script.js.NSPanels.Panel2: error at function init_dayjs: Cannot read properties of undefined (reading 'locale')
                    25.11.2023, 19:11:24.842	[info ]: javascript.0 (1121) script.js.NSPanels.Panel2: setObjects enabled - create Alias Channels possible
                    25.11.2023, 19:11:24.872	[info ]: javascript.0 (1121) script.js.NSPanels.Panel2: weather alias for accuweather.0. already exists
                    25.11.2023, 19:11:25.028	[info ]: javascript.0 (1121) script.js.NSPanels.Panel2: registered 30 subscriptions, 7 schedules, 0 messages, 0 logs and 0 file subscriptions
                    25.11.2023, 19:11:25.672	[info ]: javascript.0 (1121) script.js.NSPanels.Panel2: Desired TFT Firmware: 53 / v4.3.3
                    25.11.2023, 19:11:25.673	[info ]: javascript.0 (1121) script.js.NSPanels.Panel2: Installed TFT Firmware: 53 / v4.3.3
                    25.11.2023, 19:11:25.864	[info ]: javascript.0 (1121) script.js.NSPanels.Panel2: Debugmodus deaktiviert
                    25.11.2023, 19:11:26.723	[warn ]: javascript.0 (1121)     at script.js.NSPanels.Panel2:3161:46
                    25.11.2023, 19:11:26.724	[warn ]: javascript.0 (1121)     at step (script.js.NSPanels.Panel2:33:23)
                    25.11.2023, 19:11:26.725	[warn ]: javascript.0 (1121)     at Object.next (script.js.NSPanels.Panel2:14:53)
                    25.11.2023, 19:11:26.726	[warn ]: javascript.0 (1121)     at fulfilled (script.js.NSPanels.Panel2:5:58)
                    25.11.2023, 19:11:29.569	[info ]: javascript.0 (1121) script.js.NSPanels.Panel2: Start MQTT-Port-Check -------------------------------------
                    25.11.2023, 19:11:29.570	[info ]: javascript.0 (1121) script.js.NSPanels.Panel2: -- admin.0                   - 8081
                    25.11.2023, 19:11:29.570	[info ]: javascript.0 (1121) script.js.NSPanels.Panel2: -- hm-rpc.1                  - 1200
                    25.11.2023, 19:11:29.571	[info ]: javascript.0 (1121) script.js.NSPanels.Panel2: -- mqtt.0                    - 1880
                    25.11.2023, 19:11:29.571	[info ]: javascript.0 (1121) script.js.NSPanels.Panel2: -- sonoff.0                  - 1883
                    25.11.2023, 19:11:29.571	[info ]: javascript.0 (1121) script.js.NSPanels.Panel2: -- web.0                     - 8082
                    25.11.2023, 19:11:29.572	[info ]: javascript.0 (1121) script.js.NSPanels.Panel2: - MQTT-Port-Check OK: Instance of Adapter: mqtt.0 is running on Port:1880
                    25.11.2023, 19:11:29.572	[info ]: javascript.0 (1121) script.js.NSPanels.Panel2: End MQTT-Port-Check ---------------------------------------
                    25.11.2023, 19:11:36.457	[warn ]: javascript.0 (1121) script.js.NSPanels.Panel2: error at function HandleScreensaverUpdate: parseFormat is not a function
                    25.11.2023, 19:12:00.066	[warn ]: javascript.0 (1121) script.js.NSPanels.Panel2: error at function HandleScreensaverUpdate: parseFormat is not a function
                    

                    Fehler iobroker logs. Den Screensaver habe ich bisher noch nicht angepasst. Ist das original aus dem Script
                    javascript.0 2023-11-25 19:38:30.021 warn script.js.NSPanels.Panel2: error at function HandleScreensaverUpdate: parseFormat is not a function

                    ArmilarA Offline
                    ArmilarA Offline
                    Armilar
                    Most Active Forum Testing
                    schrieb am zuletzt editiert von
                    #4357

                    @jayjojayson

                    dayjs muss ebenfalls in die npm eingetragen werden

                    https://github.com/joBr99/nspanel-lovelace-ui/wiki/ioBroker---Basisinstallation#8--einstellungen-in-js-adapter-instanz

                    Installationsanleitung, Tipps, Alias-Definitionen, FAQ für das Sonoff NSPanel mit lovelace UI unter ioBroker
                    https://github.com/joBr99/nspanel-lovelace-ui/wiki

                    Benutzt das Voting rechts unten im Beitrag wenn er euch geholfen hat.

                    jayjojaysonJ ArmilarA 2 Antworten Letzte Antwort
                    1
                    • ArmilarA Armilar

                      @jayjojayson

                      dayjs muss ebenfalls in die npm eingetragen werden

                      https://github.com/joBr99/nspanel-lovelace-ui/wiki/ioBroker---Basisinstallation#8--einstellungen-in-js-adapter-instanz

                      jayjojaysonJ Offline
                      jayjojaysonJ Offline
                      jayjojayson
                      schrieb am zuletzt editiert von
                      #4358

                      @armilar danke und request habe ich auch noch eingefügt...
                      jetzt scheint es zu klappen.. dann kann ich mich nun um den screensaver kümmern..

                      1 Antwort Letzte Antwort
                      1
                      • ArmilarA Armilar

                        @jayjojayson

                        dayjs muss ebenfalls in die npm eingetragen werden

                        https://github.com/joBr99/nspanel-lovelace-ui/wiki/ioBroker---Basisinstallation#8--einstellungen-in-js-adapter-instanz

                        ArmilarA Offline
                        ArmilarA Offline
                        Armilar
                        Most Active Forum Testing
                        schrieb am zuletzt editiert von Armilar
                        #4359

                        Update v4.3.3.12

                        cf6b5532-2061-473e-9764-19105a5d3b1c-image.png

                        Wie heute schon angekündigt (siehe auch https://forum.iobroker.net/post/1085997), gibt es ein neues Gimmick in der cardPower

                        • Wenn der Parameter alwaysOnDisplay: true im PageItem wie im nachfolgenden Beispiel mitgegeben wird, dann wird:
                          • der Screensaver, wenn man auf dieser cardPower ist, nicht mehr aktiv
                          • die Updates werden gesendet, ohne dass die komplette cardPower gerendert wird
                          • um wieder in den Screensaver-Modus zu gelangen, muss die cardPower über die Navigation verlassen werden...
                        let CardPower = <PagePower>
                        {
                            'type': 'cardPower',
                            'heading': 'Energiefluss',
                            'useColor': true,
                            'items': [
                                <PageItem>{ id: 'alias.0.NSPanel.cardPower', 
                                            alwaysOnDisplay: true }
                            ]
                        };
                        

                        Update auf v4.3.3.12
                        https://github.com/joBr99/nspanel-lovelace-ui/blob/main/ioBroker/NsPanelTs.ts

                        Es reicht, den unteren Teil ab:
                        77ebf5cb-0bf2-4a52-a975-873b74946de5-image.png
                        zu tauschen.

                        Um jetzt aber nicht eine komplette Version zu überspringen, gibt es noch eine Vorversion v4.3.3.11, welche jetzt natürlich mit der v4.3.3.12 ersetzt wird, jedoch ebenfalls Neuigkeiten hatte:

                        502a06f2-3a85-4ccb-a229-775706adf818-image.png

                        Die cardQR legt sich jetzt automatisch an, sofern der Parameter autoCreateALias im PageItem mitgegeben wird (@TT-Tom wird die Wiki für die cardQR ab Montag noch überarbeiten)

                        Viel Spaß mit den neuen Funktionen

                        LG
                        @TT-Tom & Armilar :blush:

                        Installationsanleitung, Tipps, Alias-Definitionen, FAQ für das Sonoff NSPanel mit lovelace UI unter ioBroker
                        https://github.com/joBr99/nspanel-lovelace-ui/wiki

                        Benutzt das Voting rechts unten im Beitrag wenn er euch geholfen hat.

                        theknutT 1 Antwort Letzte Antwort
                        3
                        • ArmilarA Armilar

                          Update v4.3.3.12

                          cf6b5532-2061-473e-9764-19105a5d3b1c-image.png

                          Wie heute schon angekündigt (siehe auch https://forum.iobroker.net/post/1085997), gibt es ein neues Gimmick in der cardPower

                          • Wenn der Parameter alwaysOnDisplay: true im PageItem wie im nachfolgenden Beispiel mitgegeben wird, dann wird:
                            • der Screensaver, wenn man auf dieser cardPower ist, nicht mehr aktiv
                            • die Updates werden gesendet, ohne dass die komplette cardPower gerendert wird
                            • um wieder in den Screensaver-Modus zu gelangen, muss die cardPower über die Navigation verlassen werden...
                          let CardPower = <PagePower>
                          {
                              'type': 'cardPower',
                              'heading': 'Energiefluss',
                              'useColor': true,
                              'items': [
                                  <PageItem>{ id: 'alias.0.NSPanel.cardPower', 
                                              alwaysOnDisplay: true }
                              ]
                          };
                          

                          Update auf v4.3.3.12
                          https://github.com/joBr99/nspanel-lovelace-ui/blob/main/ioBroker/NsPanelTs.ts

                          Es reicht, den unteren Teil ab:
                          77ebf5cb-0bf2-4a52-a975-873b74946de5-image.png
                          zu tauschen.

                          Um jetzt aber nicht eine komplette Version zu überspringen, gibt es noch eine Vorversion v4.3.3.11, welche jetzt natürlich mit der v4.3.3.12 ersetzt wird, jedoch ebenfalls Neuigkeiten hatte:

                          502a06f2-3a85-4ccb-a229-775706adf818-image.png

                          Die cardQR legt sich jetzt automatisch an, sofern der Parameter autoCreateALias im PageItem mitgegeben wird (@TT-Tom wird die Wiki für die cardQR ab Montag noch überarbeiten)

                          Viel Spaß mit den neuen Funktionen

                          LG
                          @TT-Tom & Armilar :blush:

                          theknutT Offline
                          theknutT Offline
                          theknut
                          schrieb am zuletzt editiert von theknut
                          #4360

                          EDIT: Alles gut, mein Fehler, sorry.

                          ☕ @ https://ko-fi.com/theknut

                          ArmilarA 1 Antwort Letzte Antwort
                          0
                          • theknutT theknut

                            EDIT: Alles gut, mein Fehler, sorry.

                            ArmilarA Offline
                            ArmilarA Offline
                            Armilar
                            Most Active Forum Testing
                            schrieb am zuletzt editiert von Armilar
                            #4361

                            Update v4.3.3.13

                            Dieses mal sind die Media-Player dran ;-)

                            c662d823-789e-4eaa-9bef-f74869974ae1-image.png

                            Was ist neu:
                            Wenn der Parameter alwaysOnDisplay: true im PageItem wie im nachfolgenden Beispiel mitgegeben wird, dann:

                            • wird der Screensaver, wenn man auf dieser cardMedia ist, nicht mehr aktiv
                            • werden die Updates werden gesendet, ohne dass die komplette cardMedia gerendert wird
                            • Der Sonos Player kann jetzt auch Shuffle und Repeat (hat sich aber bisher auch keiner gemeldet, dass das nicht funktionierte :grin: )
                              Um wieder in den Screensaver-Modus zu gelangen, muss die cardMedia über die Navigation verlassen werden...

                            Beispiel (okay - eigentlich benutze ich den genau "so" ;-) ) :

                            let SpotifyPremium = <PageMedia>
                            {
                                'type': 'cardMedia',
                                'heading': 'Spotify-Premium',
                                'useColor': true,
                                'items': [<PageItem>{ 
                                            id: AliasPath + 'Media.PlayerSpotifyPremium', 
                                            adapterPlayerInstance: "spotify-premium.0.",
                                            speakerList: ['Überall','Echo Spot Buero','Esszimmer','Heimkino','Gartenhaus','Echo Dot Hobby',
                                                          'Echo Dot OG Badezimmer','Echo Dot Küche','Echo Dot Gästezimmer','Echo Dot Badezimmer',
                                                          'Echo Plus Esszimmer','Echo Esszimmer','Lenovo-W11'],
                                            playList: ['PartyPlaylist','Sabaton Radio','Rock Party','This Is Nightwish','Metal Christmas',
                                                       'John Diva & the Rockets of Love Radio','Dein Mixtape 2', 'Hartmann Radio', 'This Is Hartmann', 
                                                       'This Is Saltatio Mortis','This Is Die Ärzte', 'This Is Alter Bridge', 'This Is Foo Fighters',
                                                       'Discover Weekly','Merry Axemas','Neue Deutsche Welle','Top-Songs - Global'],
                                            repeatList: ['off','context','track'],
                                            equalizerList: ['Bassboost','Klassik','Dance', 'Deep', 'Electronic', 'Flat', 'Hip-Hop', 'Rock', 
                                                            'Metal', 'Jazz', 'Latin', 'Tonstärke', 'Lounge', 'Piano'],
                                            colorMediaIcon: colorSpotify,
                                            colorMediaArtist: Yellow,
                                            colorMediaTitle: Yellow,
                                            alwaysOnDisplay: true,
                                            autoCreateALias: true
                                         }]
                            };
                            

                            Also einfach im PageItem alwaysOnDisplay: true, hinzufügen und es läuft... Mache auch noch Screens von der sehr flüssigen Bedienung der Media-Player

                            Wo kann es noch Probleme geben?
                            Leider ist es mir nicht möglich die cardMedia mit dem Squeezebox-RPC oder Volumio zu testen. Ich gehe davon aus, dass sie analog der anderen Media-Player funktionieren, kann es aber nicht wirklich beantworten

                            Update auf v4.3.3.13
                            https://github.com/joBr99/nspanel-lovelace-ui/blob/main/ioBroker/NsPanelTs.ts

                            Es reicht, den unteren Teil ab:
                            28af4250-0641-4973-85f4-ab0d9b0d6ada-image.png
                            zu tauschen.

                            LG
                            @TT-Tom & Armilar :blush:

                            EDIT: Irgendwie kommt mir gerade in den Sinn, ein popupTimer aufzuschalten, wenn ein Alexa-Timer an ist :joy:

                            Installationsanleitung, Tipps, Alias-Definitionen, FAQ für das Sonoff NSPanel mit lovelace UI unter ioBroker
                            https://github.com/joBr99/nspanel-lovelace-ui/wiki

                            Benutzt das Voting rechts unten im Beitrag wenn er euch geholfen hat.

                            1 Antwort Letzte Antwort
                            4
                            • L Offline
                              L Offline
                              lgrube
                              schrieb am zuletzt editiert von
                              #4362

                              @armilar said in SONOFF NSPanel mit Lovelace UI:

                              @tt-tom
                              @lgrube

                              Falls noch nicht passiert, würde ich mal den kompletten ioBroker neu starten...

                              Manchmal sind es die einfachen Dinge, danke! Dachte ich hätte das schon längst probiert, aber dem war wohl nicht so. Funktioniert jetzt ohne Probleme mit dem Abspeichern.
                              NS-Panel mit Media Player läuft auf jeden Fall. Allerdings ist die Betätigung des Play/Pause Buttons nicht wirklich zuverlässig. Mal reagiert er prompt, mal gar nicht, mal zeitverzögert. Ist das bekannt? Bin aktuell auf Skript Version 4.3.3.9.

                              ArmilarA 1 Antwort Letzte Antwort
                              0
                              • L lgrube

                                @armilar said in SONOFF NSPanel mit Lovelace UI:

                                @tt-tom
                                @lgrube

                                Falls noch nicht passiert, würde ich mal den kompletten ioBroker neu starten...

                                Manchmal sind es die einfachen Dinge, danke! Dachte ich hätte das schon längst probiert, aber dem war wohl nicht so. Funktioniert jetzt ohne Probleme mit dem Abspeichern.
                                NS-Panel mit Media Player läuft auf jeden Fall. Allerdings ist die Betätigung des Play/Pause Buttons nicht wirklich zuverlässig. Mal reagiert er prompt, mal gar nicht, mal zeitverzögert. Ist das bekannt? Bin aktuell auf Skript Version 4.3.3.9.

                                ArmilarA Offline
                                ArmilarA Offline
                                Armilar
                                Most Active Forum Testing
                                schrieb am zuletzt editiert von Armilar
                                #4363

                                @lgrube

                                Sieh mal einen Post oben drüber... Das ist ein cardMedia-Update (v4.3.3.13)

                                Sollte flüssiger sein, wenn der Parameter alwaysOnDisplay: true benutzt wird.

                                Jedoch werden die Updates immer dann gemacht, wenn der jeweilige Adapter auch wirklich den Datenpunkt geschrieben hat. Der Zeitversatz kommt also durch die Media-Adapter in Kombination mit der Systemgeschwindigkeit zustande. Also auch Latenzen durch die Clouds der Anbieter.

                                Installationsanleitung, Tipps, Alias-Definitionen, FAQ für das Sonoff NSPanel mit lovelace UI unter ioBroker
                                https://github.com/joBr99/nspanel-lovelace-ui/wiki

                                Benutzt das Voting rechts unten im Beitrag wenn er euch geholfen hat.

                                ArmilarA 1 Antwort Letzte Antwort
                                0
                                • ArmilarA Armilar

                                  @lgrube

                                  Sieh mal einen Post oben drüber... Das ist ein cardMedia-Update (v4.3.3.13)

                                  Sollte flüssiger sein, wenn der Parameter alwaysOnDisplay: true benutzt wird.

                                  Jedoch werden die Updates immer dann gemacht, wenn der jeweilige Adapter auch wirklich den Datenpunkt geschrieben hat. Der Zeitversatz kommt also durch die Media-Adapter in Kombination mit der Systemgeschwindigkeit zustande. Also auch Latenzen durch die Clouds der Anbieter.

                                  ArmilarA Offline
                                  ArmilarA Offline
                                  Armilar
                                  Most Active Forum Testing
                                  schrieb am zuletzt editiert von
                                  #4364

                                  Kleiner Zusatz zum Update...

                                  Der Sonos-Player wird in den nächsten Tagen noch eine Playlist und eine Tracklist bekommen...

                                  Installationsanleitung, Tipps, Alias-Definitionen, FAQ für das Sonoff NSPanel mit lovelace UI unter ioBroker
                                  https://github.com/joBr99/nspanel-lovelace-ui/wiki

                                  Benutzt das Voting rechts unten im Beitrag wenn er euch geholfen hat.

                                  CluniC 1 Antwort Letzte Antwort
                                  0
                                  • ArmilarA Armilar

                                    Kleiner Zusatz zum Update...

                                    Der Sonos-Player wird in den nächsten Tagen noch eine Playlist und eine Tracklist bekommen...

                                    CluniC Offline
                                    CluniC Offline
                                    Cluni
                                    schrieb am zuletzt editiert von
                                    #4365

                                    Moin zusammen,
                                    ich habe ein Problem mit den Pages, die auf dem Panel angezeigt werden sollen. Grundsätzlich funktioniert alles, aber irgendwie funktioniert der Button, um auf die nächste Seite zu kommen, nicht so, wie er soll.
                                    Beispiel: Wenn das Panel gestartet wurde und ich die Screensaver-Seite antippe, dann wird mir die erste Seite angezeigt. Ich komme dann auch mit dem Pfeil nach rechts zur nächsten Seite. Dort komme ich mit dem Pfeil nach rechts aber nicht weiter - es sei denn ich klicke irgendein Bedienelement. Danach funktioniert der Link zur nächsten Seite. Es sieht so aus, als wäre der Link vorher nicht definiert. Genauso verhält es sich mit dem Button nach links.

                                    Alle Versionen (Skript, Berry driver, Tasmota und Display) sollten aktuell sein. Außer zwei Warnings beim Start vom Skript sieht auch alles gut aus.

                                    Hier mal die beiden Warnings:

                                    javascript.0 (924856) script.js.NSPanels.Panel_Flur: error at function check_updates: Cannot read properties of null (reading 'split')
                                    
                                    javascript.0 (924856) script.js.NSPanels.Panel_Flur: error setState in function get_tasmota_status0Cannot read properties of undefined (reading 'Version')
                                    

                                    Hab das mal im Video festgehalten. Hoffe, dass jeder das so ansehen kann:
                                    Link zum Video

                                    ArmilarA 1 Antwort Letzte Antwort
                                    0
                                    • CluniC Cluni

                                      Moin zusammen,
                                      ich habe ein Problem mit den Pages, die auf dem Panel angezeigt werden sollen. Grundsätzlich funktioniert alles, aber irgendwie funktioniert der Button, um auf die nächste Seite zu kommen, nicht so, wie er soll.
                                      Beispiel: Wenn das Panel gestartet wurde und ich die Screensaver-Seite antippe, dann wird mir die erste Seite angezeigt. Ich komme dann auch mit dem Pfeil nach rechts zur nächsten Seite. Dort komme ich mit dem Pfeil nach rechts aber nicht weiter - es sei denn ich klicke irgendein Bedienelement. Danach funktioniert der Link zur nächsten Seite. Es sieht so aus, als wäre der Link vorher nicht definiert. Genauso verhält es sich mit dem Button nach links.

                                      Alle Versionen (Skript, Berry driver, Tasmota und Display) sollten aktuell sein. Außer zwei Warnings beim Start vom Skript sieht auch alles gut aus.

                                      Hier mal die beiden Warnings:

                                      javascript.0 (924856) script.js.NSPanels.Panel_Flur: error at function check_updates: Cannot read properties of null (reading 'split')
                                      
                                      javascript.0 (924856) script.js.NSPanels.Panel_Flur: error setState in function get_tasmota_status0Cannot read properties of undefined (reading 'Version')
                                      

                                      Hab das mal im Video festgehalten. Hoffe, dass jeder das so ansehen kann:
                                      Link zum Video

                                      ArmilarA Offline
                                      ArmilarA Offline
                                      Armilar
                                      Most Active Forum Testing
                                      schrieb am zuletzt editiert von Armilar
                                      #4366

                                      @cluni

                                      Die beiden Fehler kommen daher, dass das Rate-Limit bei Github für heute aufgebraucht, d.h. die Updates kommen leer zurück und es kann keine Versionsnummer ermittelt werden... Ist aber auch kein Problem, da ja alles vorhanden sein sollte... Morgen sind die Warnungen wieder weg...

                                      Ich vermute mal, dass du vergessen hast einen Haken aus der MQTT-Instanz herauszunehmen.

                                      Sieh mal bitte nach:
                                      f389dcf5-15b9-4818-9a35-85b3a7e042c6-image.png
                                      Nur bei Änderungen publizieren darf auf keinen Fall gesetzt sein...

                                      Installationsanleitung, Tipps, Alias-Definitionen, FAQ für das Sonoff NSPanel mit lovelace UI unter ioBroker
                                      https://github.com/joBr99/nspanel-lovelace-ui/wiki

                                      Benutzt das Voting rechts unten im Beitrag wenn er euch geholfen hat.

                                      CluniC 1 Antwort Letzte Antwort
                                      1
                                      • ArmilarA Armilar

                                        @cluni

                                        Die beiden Fehler kommen daher, dass das Rate-Limit bei Github für heute aufgebraucht, d.h. die Updates kommen leer zurück und es kann keine Versionsnummer ermittelt werden... Ist aber auch kein Problem, da ja alles vorhanden sein sollte... Morgen sind die Warnungen wieder weg...

                                        Ich vermute mal, dass du vergessen hast einen Haken aus der MQTT-Instanz herauszunehmen.

                                        Sieh mal bitte nach:
                                        f389dcf5-15b9-4818-9a35-85b3a7e042c6-image.png
                                        Nur bei Änderungen publizieren darf auf keinen Fall gesetzt sein...

                                        CluniC Offline
                                        CluniC Offline
                                        Cluni
                                        schrieb am zuletzt editiert von Cluni
                                        #4367

                                        Guten Morgen!

                                        @armilar said in SONOFF NSPanel mit Lovelace UI:

                                        Nur bei Änderungen publizieren darf auf keinen Fall gesetzt sein...

                                        Vielen Dank für die schnelle Hilfe. Ich habe gerade mal nachgesehen und der Haken war gesetzt. Ob es dies nun war, kann ich erst heute Abend testen. Aber vermutlich war es ja das dann. Wie gesagt: Vielen Dank für den schnellen Support - ich bin gestern Nachmittag fast daran verzweifelt... :see_no_evil:

                                        @armilar said in SONOFF NSPanel mit Lovelace UI:

                                        Morgen sind die Warnungen wieder weg...

                                        Habe gerade das Skript mal neu gestartet, aber die Warnungen sind noch da. Aber das stört mich nicht wirklich - ich schaue eh von Zeit zu Zeit immer mal überall durch, ob man was auf den neusten Stand bringen kann. ;)

                                        1 Antwort Letzte Antwort
                                        1
                                        • T Offline
                                          T Offline
                                          TT-Tom
                                          schrieb am zuletzt editiert von TT-Tom
                                          #4368

                                          @cluni sagte in SONOFF NSPanel mit Lovelace UI:

                                          Habe gerade das Skript mal neu gestartet, aber die Warnungen sind noch da. Aber das stört mich nicht wirklich - ich schaue eh von Zeit zu Zeit immer mal überall durch, ob man was auf den neusten Stand bringen kann.

                                          Morgen

                                          habe die aktuelle Scriptversion mal gestartet, ohne Probleme bzw. Warnungen. Welche Version hast du grade am laufen, kannst du mal in die Tasmota Konsole schauen, ob Daten gesendet werden. sollte so aussehen.

                                          09:26:38.078 MQT: SmartHome/NSPanel_1/tele/STATE = {"Time":"2023-11-27T09:26:38","Uptime":"8T16:15:28","UptimeSec":749728,"Heap":85,"SleepMode":"Dynamic","Sleep":50,"LoadAvg":19,"MqttCount":33,"Berry":{"HeapUsed":53,"Objects":652},"POWER1":"ON","POWER2":"ON","Wifi":{"AP":1,"SSId":"TomTom24","BSSId":"2C:91:AB:AF:46:A7","Channel":2,"Mode":"11n","RSSI":68,"Signal":-66,"LinkCount":14,"Downtime":"0T00:02:35"}}
                                          09:26:38.099 MQT: SmartHome/NSPanel_1/tele/SENSOR = {"Time":"2023-11-27T09:26:38","ANALOG":{"Temperature1":-3.6},"ESP32":{"Temperature":70.0},"TempUnit":"C"}
                                          09:26:46.233 MQT: SmartHome/NSPanel_1/stat/STATUS0 = {"Status":{"Module":0,"DeviceName":"NSPanelBuero","FriendlyName":["NSPanelBuero",""],"Topic":"NSPanel_1","ButtonTopic":"0","Power":3,"PowerOnState":3,"LedState":1,"LedMask":"FFFF","SaveData":1,"SaveState":1,"SwitchTopic":"0","SwitchMode":[0,0,0,0,0,0,0,0,0,0,0,0,0,0,0,0,0,0,0,0,0,0,0,0,0,0,0,0],"ButtonRetain":0,"SwitchRetain":0,"SensorRetain":0,"PowerRetain":0,"InfoRetain":0,"StateRetain":0,"StatusRetain":0},"StatusPRM":{"Baudrate":115200,"SerialConfig":"8N1","GroupTopic":"tasmotas","OtaUrl":"http://ota.tasmota.com/tasmota32/release/tasmota32-DE.bin","RestartReason":"Software reset CPU","Uptime":"8T16:15:36","StartupUTC":"2023-11-18T16:11:10","Sleep":50,"CfgHolder":4617,"BootCount":32,"BCResetTime":"2023-01-05T06:15:40","SaveCount":277},"StatusFWR":{"Version":"13.2.0(tasmota32)","BuildDateTime":"2023.10.19 09:11:03","Core":"2_0_14","SDK":"4.4.6.231011","CpuFrequency":160,"Hardware":"ESP32-D0WD-V3 v3.0","CR":"452/699"},"StatusLOG":{"SerialLog":2,"WebLog":2,"MqttLog":2,"SysLog":0,"LogHost":"192.168.178.121","LogPort":514,"SSId":["TomTom24",""],"TelePeriod":300,"Resolution":"558180C0","SetOption":["00008009","2805C80001000600003C5A0A192800000000","00000080","00006000","00004000","00000001"]},"StatusMEM":{"ProgramSize":1873,"Free":1006,"Heap":87,"StackLowMark":4,"PsrMax":0,"PsrFree":0,"ProgramFlashSize":4096,"FlashSize":4096,"FlashChipId":"16405E","FlashFrequency":40,"FlashMode":"DIO","Features":["00000407","9F9AD7DF","0015A001","B7F7BFCF","05DA9BC4","E0360DC7","480840D2","20200000","D4BC482D","010A80B1"],"Drivers":"1,2,3,4,5,7,8,9,10,11,12,14,16,17,20,21,24,26,27,29,34,35,38,50,52,59,60,62,63,66,67,68,82,86,87,88","Sensors":"1,2,3,5,6,7,8,9,10,11,12,13,14,15,17,18,19,20,21,22,26,31,34,37,39,40,42,43,45,51,52,55,56,58,59,64,66,67,74,85,92,95,98,103,105,109,127","I2CDriver":"7,8,9,10,11,12,13,14,15,17,18,20,24,29,31,36,41,42,44,46,48,58,62,65,69,76,77,82"},"StatusNET":{"Hostname":"NSPanelBuero","IPAddress":"192.168.178.101","Gateway":"192.168.178.1","Subnetmask":"255.255.255.0","DNSServer1":"192.168.178.1","DNSServer2":"2a02:8109:a301:a900:b2f2:8ff:fe43:c159","Mac":"7C:87:CE:C6:1B:74","IP6Global":"2a02:8109:a301:a900:7e87:ceff:fec6:1b74","IP6Local":"fe80::7e87:ceff:fec6:1b74","Ethernet":{"Hostname":"","IPAddress":"0.0.0.0","Gateway":"0.0.0.0","Subnetmask":"0.0.0.0","DNSServer1":"192.168.178.1","DNSServer2":"2a02:8109:a301:a900:b2f2:8ff:fe43:c159","Mac":"00:00:00:00:00:00","IP6Global":"","IP6Local":""},"Webserver":2,"HTTP_API":1,"WifiConfig":4,"WifiPower":17.0},"StatusMQT":{"MqttHost":"192.168.178.121","MqttPort":1886,"MqttClientMask":"NSPanelBüro","MqttClient":"NSPanelBüro","MqttUser":"Iobroker","MqttCount":33,"MAX_PACKET_SIZE":1200,"KEEPALIVE":30,"SOCKET_TIMEOUT":4},"StatusTIM":{"UTC":"2023-11-27T08:26:46","Local":"2023-11-27T09:26:46","StartDST":"2023-03-26T02:00:00","EndDST":"2023-10-29T03:00:00","Timezone":"+01:00","Sunrise":"08:16","Sunset":"16:58"},"StatusSNS":{"Time":"2023-11-27T09:26:46","ANALOG":{"Temperature1":-3.8},"ESP32":{"Temperature":70.0},"TempUnit":"C"},"StatusSTS":{"Time":"2023-11-27T09:26:46","Uptime":"8T16:15:36","UptimeSec":749736,"Heap":86,"SleepMode":"Dynamic","Sleep":50,"LoadAvg":21,"MqttCount":33,"Berry":{"HeapUsed":53,"Objects":652},"POWER1":"ON","POWER2":"ON","Wifi":{"AP":1,"SSId":"TomTom24","BSSId":"2C:91:AB:AF:46:A7","Channel":2,"Mode":"11n","RSSI":68,"Signal":-66,"LinkCount":14,"Downtime":"0T00:02:35"}}}
                                          

                                          zusätzlich kannst du im Browser mal eingeben:

                                          http:// ip vom Panel /cm?cmnd=Status0
                                          

                                          Gruß Tom
                                          https://github.com/tt-tom17
                                          Wenn meine Hilfe erfolgreich war, benutze bitte das Voting unten rechts im Beitrag

                                          NSPanel Script Wiki
                                          https://github.com/joBr99/nspanel-lovelace-ui/wiki

                                          NSPanel Adapter Wiki
                                          https://github.com/ticaki/ioBroker.nspanel-lovelace-ui/wiki

                                          ArmilarA CluniC 2 Antworten Letzte Antwort
                                          1
                                          Antworten
                                          • In einem neuen Thema antworten
                                          Anmelden zum Antworten
                                          • Älteste zuerst
                                          • Neuste zuerst
                                          • Meiste Stimmen


                                          Support us

                                          ioBroker
                                          Community Adapters
                                          Donate

                                          811

                                          Online

                                          32.4k

                                          Benutzer

                                          81.5k

                                          Themen

                                          1.3m

                                          Beiträge
                                          Community
                                          Impressum | Datenschutz-Bestimmungen | Nutzungsbedingungen | Einwilligungseinstellungen
                                          ioBroker Community 2014-2025
                                          logo
                                          • Anmelden

                                          • Du hast noch kein Konto? Registrieren

                                          • Anmelden oder registrieren, um zu suchen
                                          • Erster Beitrag
                                            Letzter Beitrag
                                          0
                                          • Home
                                          • Aktuell
                                          • Tags
                                          • Ungelesen 0
                                          • Kategorien
                                          • Unreplied
                                          • Beliebt
                                          • GitHub
                                          • Docu
                                          • Hilfe